2017-12-08 |
attila |
8192970: Element getters/setters with fixed key fail to link properly
|
changeset |
files
|
2017-12-08 |
clanger |
8193183: Fix format string in libdt_shmem/shmemBase.c
|
changeset |
files
|
2017-12-08 |
ksrini |
8034254: Don't use binary testing files broken.jar
|
changeset |
files
|
2017-12-08 |
weijun |
8192987: keytool should remember real storetype if it is not provided
|
changeset |
files
|
2017-12-07 |
ksrini |
8149402: "-group" option issue for classes from default package
|
changeset |
files
|
2017-12-07 |
smarks |
8177681: Remove methods Runtime.getLocalized{Input,Output}Stream
|
changeset |
files
|
2017-12-07 |
ksrini |
8191030: @value Tags are not resolved by javadoc 9.
|
changeset |
files
|
2017-12-07 |
erikj |
8188789: Update JDK 9.0.1 and Future OpenJDK bundle names
|
changeset |
files
|
2017-12-07 |
lana |
Merge
|
changeset |
files
|
2017-12-07 |
lana |
Added tag jdk-10+35 for changeset d8c634b016c6
|
changeset |
files
|
2017-12-07 |
darcy |
8193191: Update JavacTestingAbstractProcessor for JDK 10
|
changeset |
files
|
2017-12-07 |
jlahoda |
8189248: Jshell: error with mutually dependent snippets, when one must be replaced
|
changeset |
files
|
2017-12-07 |
igerasim |
8193156: Need to backout fixes for JDK-8058547, JDK-8055753, JDK-8085903
|
changeset |
files
|
2017-12-07 |
mchung |
8192945: Need stable sort for MODULES entry in the release file
|
changeset |
files
|
2017-12-07 |
mchung |
8193159: Reduce the number of classes loaded due to NativeLibrary
|
changeset |
files
|
2017-12-07 |
bpb |
8191872: (fs) UnixNativeDispatcher conditionally compiles in support for high precision timestamps
|
changeset |
files
|
2017-12-07 |
alanb |
8191867: Module attribute in 54.0+ class file cannot contains a requires java.base with ACC_TRANSITIVE or ACC_STATIC_PHASE
|
changeset |
files
|
2017-12-05 |
sjohanss |
8193068: Add gc/g1/TestVerifyGCType.java to problem list
|
changeset |
files
|
2017-12-07 |
jiangli |
8193065: [TESTBUG] [TESTBUG]GCSharedStringsDuringDump.java: Exception in thread "main" java.lang.RuntimeException: String is not shared.
|
changeset |
files
|
2017-12-07 |
dlong |
8193009: compiler/c2/Test7029152.java crashes with SIGILL in java.lang.StringLatin1.indexOf with -XX:+UseJVMCICompiler
|
changeset |
files
|
2017-12-05 |
sjohanss |
8192983: gc/g1/TestVerifyGCType.java might fail on loaded machines
|
changeset |
files
|
2017-12-05 |
hb |
8192909: Invalid username or password in HashedPasswordFileTest.java
|
changeset |
files
|
2017-12-02 |
roland |
8191950: assertion failed: no insertions allowed
|
changeset |
files
|
2017-12-02 |
jwilhelm |
Merge
|
changeset |
files
|
2017-12-02 |
vdeshpande |
8170244: Update UseAVX after cpu feature detection to use more default mapping
|
changeset |
files
|
2017-12-02 |
vdeshpande |
8190494: Different results with UseAVX=3 when calling AVX-512 native function via JNI
|
changeset |
files
|
2017-12-02 |
roland |
8192762: LoopNode::verify_strip_mined() fails with "assert failed: only phis"
|
changeset |
files
|
2017-12-01 |
iignatyev |
8191273: applications/ctw/modules tests fail intermittently
|
changeset |
files
|
2017-12-01 |
iklam |
8190809: JVM crashes while generating appcds for classpath with empty directory entry
|
changeset |
files
|
2017-12-01 |
dlong |
8192814: Update Graal
|
changeset |
files
|
2017-12-01 |
coleenp |
Merge
|
changeset |
files
|
2017-12-01 |
mdoerr |
8192898: AIX build broken after JDK-8190308
|
changeset |
files
|
2017-12-01 |
mdoerr |
8192825: PPC64: Missing null check in C1 inline cache check
|
changeset |
files
|
2017-12-01 |
lucy |
8192818: [s390]: restoring register contents calculates wrong value
|
changeset |
files
|
2017-12-01 |
egahlin |
8179083: Uninitialized notifier in Java Monitor Wait tracing event
|
changeset |
files
|
2017-12-01 |
dcubed |
8192810: EnableThreadSMRStatistics should be default off in release builds
|
changeset |
files
|
2017-12-01 |
dpochepk |
8189439: Parameters type profiling is not performed from aarch64 interpreter
|
changeset |
files
|
2017-12-01 |
dchuyko |
8191129: AARCH64: Invalid value passed to critical JNI function
|
changeset |
files
|
2017-12-01 |
jgeorge |
8191538: SA: tests for clhsdb commands: vmstructsdump, field, symboltable and symbol
|
changeset |
files
|
2017-12-01 |
jcm |
8006887: Comment about LIR_OprDesc.value in c1_LIR.hpp is incorrect
|
changeset |
files
|
2017-12-01 |
sjohanss |
8191821: Finer granularity for GC verification
|
changeset |
files
|
2017-12-01 |
jgeorge |
8191914: New SA test timeout on windows
|
changeset |
files
|
2017-12-01 |
mseledtsov |
8192866: [TESTBUG] Move UseAppCDS.java from the closed ProblemList.txt to the open one
|
changeset |
files
|
2017-12-01 |
mseledtsov |
8191943: [TESTBUG] docker/TestCPUAwareness fails on machine with 2 CPUs
|
changeset |
files
|
2017-12-01 |
ysuenaga |
8190837: BasicType and BasicTypeSize should refer to HotSpot values
|
changeset |
files
|
2017-12-01 |
cjplummer |
8192840: serviceability/dcmd/jvmti/AttachFailed/AttachNoEntry.java failing on Windows
|
changeset |
files
|
2017-11-30 |
dcubed |
8191787: move private inline functions from thread.inline.hpp -> thread.cpp
|
changeset |
files
|
2017-11-30 |
dlong |
8191437: AOT doesn't work easily after thread local handshakes
|
changeset |
files
|
2017-11-30 |
ccheung |
8174101: Bootclasspath append should not invalidate CDS archive
|
changeset |
files
|
2017-11-30 |
ecaspole |
8192821: Make LogCompilation into a maven project
|
changeset |
files
|
2017-11-30 |
eosterlund |
8186787: clang-4.0 SIGSEGV in Unsafe_PutByte
|
changeset |
files
|
2017-11-30 |
rkennke |
8191564: Refactor GC related servicability code into GC specific subclasses
|
changeset |
files
|
2017-11-30 |
iveresov |
8192756: SIGSEGV in nmethod::new_native_nmethod
|
changeset |
files
|
2017-11-30 |
jgeorge |
8191324: SA cleanup -- part 2
|
changeset |
files
|
2017-11-30 |
rehn |
8192072: 8191782 fix for VMDeprecatedOptions.java missed DeferThrSuspendLoopCount and duplicated DeferPollingPageLoopCount
|
changeset |
files
|
2017-11-30 |
ecaspole |
Merge
|
changeset |
files
|
2017-11-30 |
ecaspole |
8191779: LogCompilation throws java.lang.Error: scope underflow
|
changeset |
files
|
2017-11-30 |
bobv |
Merge
|
changeset |
files
|
2017-11-30 |
bobv |
8192154: JVM crashes inside some chroot environments on linux
|
changeset |
files
|
2017-11-30 |
sballal |
8191658: SA: Testcases for attach, detach, reattach and Jhisto commands
|
changeset |
files
|
2017-11-30 |
sjohanss |
8192807: testlibrary_tests/TestMutuallyExclusivePlatformPredicates.java fail due to new method in Platform.java
|
changeset |
files
|
2017-11-30 |
sballal |
8184982: SA: Running ClassDump on a simple java program generates NullPointerException
|
changeset |
files
|
2017-11-28 |
stefank |
8192061: Clean up allocation.inline.hpp includes
|
changeset |
files
|
2017-11-30 |
iklam |
8191747: [TESTBUG] runtime/appcds/DumpClassList.java and ProhibitedPackage.java fail on product bits
|
changeset |
files
|
2017-11-28 |
iklam |
8191927: Enable AppCDS for custom loaders on all 64-bit Linux and AIX
|
changeset |
files
|
2017-11-30 |
kkharbas |
8190980: Develop test cases and collect test pass rate
|
changeset |
files
|
2017-11-30 |
kkharbas |
8190308: Implementation: JEP 316: Heap Allocation on Alternative Memory Devices
|
changeset |
files
|
2017-11-29 |
kvn |
8184361: AOT lib at jdk/lib/libjava.base-coop.so seems to override -XX:AOTLibrary=
|
changeset |
files
|
2017-11-29 |
dchuyko |
8188221: Return type profiling is not performed from aarch64 interpreter
|
changeset |
files
|
2017-11-29 |
ysuenaga |
8165736: Error message should be shown when JVMTI agent cannot be attached
|
changeset |
files
|
2017-11-28 |
coleenp |
Merge
|
changeset |
files
|
2017-11-27 |
zgu |
8190729: Adjustment to anonymous metadata space chunk allocation algorithm
|
changeset |
files
|
2017-11-28 |
kbarrett |
8191870: Remove badJNIHandle
|
changeset |
files
|
2017-11-28 |
thartmann |
8191996: VM startup fails with CodeCacheExpansionSize=32768 is outside the allowed range
|
changeset |
files
|
2017-11-28 |
roland |
8186027: C2: loop strip mining
|
changeset |
files
|
2017-11-28 |
hb |
5016517: Replace plaintext passwords by hashed passwords for out-of-the-box JMX Agent
|
changeset |
files
|
2017-11-28 |
simonis |
8191863: [s390] Fix CDS: some bytecode rewriting doesn't depend on RewriteControl
|
changeset |
files
|
2017-11-28 |
simonis |
8191770: [ppc64] Fix CDS: don't rewrite invokefinal if DumpSharedSpaces
|
changeset |
files
|
2017-11-28 |
dchuyko |
8191769: AARCH64: Fix hint instructions encoding
|
changeset |
files
|
2017-11-28 |
drwhite |
8188877: Improper synchronization in offer_termination
|
changeset |
files
|
2017-11-28 |
jgeorge |
8191961: SA: Remove left over quarantined SA tests due to 8184042 from ProblemList.txt
|
changeset |
files
|
2017-11-28 |
iklam |
8188791: Move AppCDS from closed repo to open repo
|
changeset |
files
|
2017-11-28 |
jiangli |
8191504: [TESTBUG] CDSTestUtils.isUnableToMap() should check OptionalData region mapping failure
|
changeset |
files
|
2017-06-20 |
njian |
8181633: Vectorization fails for some multiplication with constant cases
|
changeset |
files
|
2017-11-28 |
roland |
8191887: assert(b->is_Bool()) in PhaseIdealLoop::clone_iff() due to Opaque4 node
|
changeset |
files
|
2017-11-27 |
dcubed |
Merge
|
changeset |
files
|
2017-11-27 |
jgeorge |
8191919: Include TestJhsdbJstackLock.java in ProblemList.txt
|
changeset |
files
|
2017-11-27 |
sangheki |
8178497: Bug in MutableNUMASpace::ensure_parsability
|
changeset |
files
|
2017-11-27 |
roland |
8191153: assert(u_ctrl != blk1 && u_ctrl != blk2) failed: won't converge
|
changeset |
files
|
2017-11-10 |
jtulach |
8189116: Give the jdk.internal.vm.compiler.management only the permissions it really needs to expose the bean
|
changeset |
files
|
2017-11-27 |
aph |
Merge
|
changeset |
files
|
2017-11-27 |
aph |
Merge
|
changeset |
files
|
2017-11-24 |
aph |
8189596: AArch64: implementation for Thread-local handshakes
|
changeset |
files
|
2017-11-24 |
glaubitz |
8186461: Zero's atomic_copy64() should use SPE instructions on linux-powerpcspe
|
changeset |
files
|
2017-11-21 |
glaubitz |
8187227: Zero should use compiler built-ins for atomics on linux-m68k
|
changeset |
files
|
2017-11-27 |
gromero |
8191868: IdealGraphVisualizer: "ant build/run" fails due to outdated bootstrap.url
|
changeset |
files
|
2017-11-27 |
pliden |
8191864: Provide a public destructor for WorkGang
|
changeset |
files
|
2017-11-27 |
pliden |
8191862: Warn about UseNUMA/UseLargePages only when using ParallelGC
|
changeset |
files
|
2017-11-27 |
pliden |
8191846: jstat prints debug message when debugging is disabled
|
changeset |
files
|
2017-11-27 |
rraghavan |
8191227: issues with unsafe handle resolution
|
changeset |
files
|
2017-11-27 |
thartmann |
8087339: The code heap might use different alignment for committed size and reserved size
|
changeset |
files
|
2017-11-27 |
thartmann |
8179026: Remove explicit code cache options processing
|
changeset |
files
|
2017-11-27 |
ehelin |
8080345: With perm gen gone, perfdata counter sun.gc.policy.generations should be 2, not 3
|
changeset |
files
|
2017-11-24 |
stefank |
8191861: Move and refactor hSpaceCounters
|
changeset |
files
|
2017-11-24 |
stefank |
8191860: Add perfData.inline.hpp
|
changeset |
files
|
2017-11-24 |
stefank |
8191858: Add missing includes in memoryManager.hpp
|
changeset |
files
|
2017-11-27 |
ysuenaga |
8185796: jstack and clhsdb jstack should show lock objects
|
changeset |
files
|
2017-11-26 |
rraghavan |
8191313: compiler/runtime/SpreadNullArg.java fails in tier1
|
changeset |
files
|
2017-11-25 |
jwilhelm |
Merge
|
changeset |
files
|
2017-11-25 |
jwilhelm |
Merge
|
changeset |
files
|
2017-11-24 |
dholmes |
8191707: Options with invalid values are incorrectly treated as obsolete and ignored
|
changeset |
files
|
2017-11-24 |
rehn |
8191782: Missing deprecated options in VMDeprecatedOptions.java
|
changeset |
files
|
2017-11-24 |
dcubed |
Merge
|
changeset |
files
|
2017-11-23 |
dcubed |
Merge
|
changeset |
files
|
2017-11-23 |
dcubed |
8167108: inconsistent handling of SR_lock can lead to crashes
|
changeset |
files
|
2017-11-22 |
aharlap |
8185591: guarantee(_byte_map[_guard_index] == last_card) failed: card table guard has been modified
|
changeset |
files
|
2017-11-23 |
tschatzl |
8190426: Lazily initialize refinement threads with UseDynamicNumberOfGCThreads
|
changeset |
files
|
2017-11-23 |
tschatzl |
8182050: assert(_whole_heap.contains(p)) failed: Attempt to access p out of bounds of card marking array's _whole_heap
|
changeset |
files
|
2017-11-23 |
tschatzl |
8179244: Assert failed in instanceMirrorKlass.inline.hpp
|
changeset |
files
|
2017-11-23 |
sjohanss |
8189733: Cleanup Full GC setup and tear down
|
changeset |
files
|
2017-11-23 |
ccheung |
Merge
|
changeset |
files
|
2017-11-23 |
ccheung |
8191653: Test failures in BootAppendTests - missing jdk.internal.vm.compiler module
|
changeset |
files
|
2017-11-22 |
simonis |
8187280: Remove unused methods from StubQueue
|
changeset |
files
|
2017-11-22 |
ctornqvi |
8191768: Introduce a concurrency factor to be able to scale up or down jtreg concurrency when running Hotspot tests
|
changeset |
files
|
2017-11-22 |
dlong |
8191688: Assert failed in > 200 tests: failed dependencies, but counter didn't change
|
changeset |
files
|
2017-11-22 |
lucy |
8189793: [s390]: Improve String compress/inflate by exploiting vector instructions
|
changeset |
files
|
2017-11-22 |
jwilhelm |
Merge
|
changeset |
files
|
2017-11-16 |
aharlap |
8187819: gc/TestFullGCALot.java fails on jdk10 started with "-XX:-UseCompressedOops" option
|
changeset |
files
|
2017-11-13 |
lkorinth |
8190408: Run G1CMRemarkTask with the appropriate amount of threads instead of starting up everyone
|
changeset |
files
|
2017-11-22 |
ihse |
8191202: Remove duplicated jmm.h
|
changeset |
files
|
2017-11-22 |
rlupusoru |
8190800: Support vectorization of Math.sqrt() on floats
|
changeset |
files
|
2017-11-22 |
iveresov |
8191683: Compile problem on ARM after JDK-8043070
|
changeset |
files
|
2017-12-06 |
ksrini |
8192933: Wrong generic type parameter in serialized form javadoc
|
changeset |
files
|
2017-12-06 |
bpb |
8191706: Add Reader::transferTo(Writer)
|
changeset |
files
|
2017-12-06 |
ksrini |
8191078: Wrong "Package not found" warning
|
changeset |
files
|
2017-12-06 |
chegar |
Merge
|
changeset |
files
|
2017-12-06 |
chegar |
8191494: Refresh incubating HTTP Client
|
changeset |
files
|
2017-12-06 |
vromero |
8192885: Compiler in JDK 10-ea+33 misses to include entry in LineNumberTable for goto instruction of foreach loop
jdk-10+35
|
changeset |
files
|
2017-11-03 |
psandoz |
8188870: Bump classfile version number to 54
|
changeset |
files
|
2017-12-06 |
coffeys |
8185855: Debug exception stacks should be clearer
|
changeset |
files
|
2017-12-06 |
ihse |
8193060: Set MAKE env variable in jib profile for gnumake
|
changeset |
files
|
2017-12-06 |
ihse |
8193061: Add run-test-prebuilt functionality
|
changeset |
files
|
2017-12-06 |
sspitsyn |
8182413: jdwp-protocol is generated without a DOCTYPE directive
|
changeset |
files
|
2017-12-06 |
alanb |
8182742: ClassLoader.getResourceXXX throws NPE when ClassLoader created by defineModulesWithXXX
|
changeset |
files
|
2017-12-06 |
alanb |
8186736: Spec clarifications for IllegalArgumentException throwing - ModuleLayer.defineX methods
|
changeset |
files
|
2017-12-06 |
alanb |
8192973: Adding "Module Resolution" to javadoc search index
|
changeset |
files
|
2017-12-06 |
akolarkunnu |
8192958: TEST.groups, group jdk_util_other:file not found: jdk/internal/uti
|
changeset |
files
|
2017-12-06 |
nishjain |
8187551: MessageFormat.setFormat(int, Format) AIOOBE not thrown when documented
|
changeset |
files
|
2017-12-06 |
sundar |
8185130: jlink should throw error if target image and current JDK versions don't match
|
changeset |
files
|
2017-12-05 |
psandoz |
8015667: Stream.toArray(IntFunction) ArrayStoreException should refer to component type of array
|
changeset |
files
|
2017-12-05 |
erikj |
8192771: Boot JDK jar tool used to construct the modular JAR for java.jnlp
|
changeset |
files
|
2017-12-05 |
erikj |
8191439: Race in building jdk.rmic.interim
|
changeset |
files
|
2017-12-05 |
redestad |
8193064: JarFile::getEntry0 method reference use cause for startup regression
|
changeset |
files
|
2017-12-05 |
bchristi |
8187222: ClassLoader.getSystemClassLoader not clear if recursive initialization leads to ISE or unspecified error
|
changeset |
files
|
2017-12-05 |
redestad |
8176188: jdk/internal/misc/JavaLangAccess/NewUnsafeString.java failing since 9-b93
|
changeset |
files
|
2017-12-05 |
ihse |
8193055: ADD_JVM_ARG_IF_OK always fails
|
changeset |
files
|
2017-11-21 |
goetz |
8191678: [TESTBUG] Add keyword headful in java/awt and javax tests.
|
changeset |
files
|
2017-12-05 |
weijun |
8190674: sun/security/tools/jarsigner/TimestampCheck.java failed with java.nio.file.NoSuchFileException: ts2.cert
|
changeset |
files
|
2017-12-04 |
ihse |
8193014: Add "special" tests to run-test to cover odd cases
|
changeset |
files
|
2017-12-04 |
ksrini |
8184683: Add @since and default methods of Compiler Tree API methods
|
changeset |
files
|
2017-12-04 |
smarks |
8177290: add copy factory methods for unmodifiable List, Set, Map
|
changeset |
files
|
2017-12-04 |
ihse |
8192995: run-test gtest should use all jvm variants, not just "server"
|
changeset |
files
|
2017-12-04 |
ihse |
8146977: Move the output "Building configuration X (matching Y)" to lower log level
|
changeset |
files
|
2017-12-04 |
ihse |
8175795: configure should verify that system zlib contains needed functionality
|
changeset |
files
|
2017-12-04 |
ihse |
8192854: FONTCONFIG_CFLAGS missing from spec.gmk.in
|
changeset |
files
|
2017-12-04 |
mcimadamore |
8189749: Devise strategy for making source level checks more uniform
|
changeset |
files
|
2017-12-04 |
clanger |
8192961: Remove some double semicolons
|
changeset |
files
|
2017-12-04 |
njian |
8191955: AArch64: incorrect prefetch distance causes an internal error
|
changeset |
files
|
2017-12-04 |
vtewari |
8190843: can not set/get extendedOptions to ServerSocket
|
changeset |
files
|
2017-12-03 |
igerasim |
8187985: Broken certificate number in debug output
|
changeset |
files
|
2017-12-03 |
igerasim |
8187497: Redundant variable assignment in Java_sun_security_jgss_wrapper_GSSLibStub_getMic
|
changeset |
files
|
2017-12-02 |
dl |
8191069: Miscellaneous changes imported from jsr166 CVS 2017-12
|
changeset |
files
|
2017-12-02 |
dl |
8187947: A race condition in SubmissionPublisher
|
changeset |
files
|
2017-12-02 |
dl |
8191937: Lost interrupt in AbstractQueuedSynchronizer when tryAcquire methods throw
|
changeset |
files
|
2017-12-02 |
sherman |
8191918: tomcat gzip-compressed response bodies appear to be broken in update 151
|
changeset |
files
|
2017-12-02 |
psandoz |
8186961: Class.getFields() does not return fields of previously visited super interfaces/classes.
|
changeset |
files
|
2017-12-02 |
jjg |
8034252: Fix non ASCII text file T6302184.java
|
changeset |
files
|
2017-12-01 |
ihse |
8192816: Let run-test save exit code
|
changeset |
files
|
2017-12-01 |
joehw |
8191938: Fix lint warnings in JAXP repo: a few Deprecation warrnings and enable -Xlint:all
|
changeset |
files
|
2017-12-01 |
erikj |
8192876: MacOS build fails intermittently after JDK-8139653
|
changeset |
files
|
2017-12-01 |
redestad |
8192892: Improve JrtPath::getResolved fast-path test
|
changeset |
files
|
2017-12-01 |
lana |
Merge
|
changeset |
files
|
2017-12-01 |
lana |
Added tag jdk-10+34 for changeset 89deac44e515
|
changeset |
files
|
2017-12-01 |
mchung |
8192879: jdk.internal.util.jar.VersionedStream is no longer needed
|
changeset |
files
|
2017-12-01 |
erikj |
8190464: OpenJDK on macosx needs to bundle freetype
|
changeset |
files
|
2017-11-30 |
smarks |
8160406: Collection.toArray() spec should be explicit about returning precisely an Object[]
|
changeset |
files
|
2017-11-30 |
rriggs |
8189331: java/io/Serializable/maskSyntheticModifier/MaskSyntheticModifierTest.java failed incorrect serialVersionUID
|
changeset |
files
|
2017-11-30 |
erikj |
8139653: Freetype bundled on macosx, but not correctly linked
|
changeset |
files
|
2017-11-30 |
sherman |
8187910: Charset MS950_HKSCS not supported in JDK 9
|
changeset |
files
|
2017-11-30 |
aefimov |
8186441: Change of behavior in the getMessage () method of the SOAPMessageContextImpl class
|
changeset |
files
|
2017-11-30 |
ksrini |
8185985: Html files in doc-files directories should be wrapped with standard header and footer
|
changeset |
files
|
2017-11-30 |
ksrini |
8190552: Augment the Compiler API tree with APIs to represent HTML content
|
changeset |
files
|
2017-11-30 |
mullan |
8186535: Remove deprecated pre-1.2 SecurityManager methods and fields
|
changeset |
files
|
2017-11-30 |
nishjain |
6354947: [Fmt-*] Clarify DecimalFormat description of FieldPosition use
jdk-10+34
|
changeset |
files
|
2017-11-24 |
dholmes |
8191707: Options with invalid values are incorrectly treated as obsolete and ignored
|
changeset |
files
|
2017-11-22 |
dlong |
8191688: Assert failed in > 200 tests: failed dependencies, but counter didn't change
|
changeset |
files
|
2017-11-23 |
ccheung |
8191653: Test failures in BootAppendTests - missing jdk.internal.vm.compiler module
|
changeset |
files
|
2017-11-26 |
rraghavan |
8191313: compiler/runtime/SpreadNullArg.java fails in tier1
|
changeset |
files
|
2017-11-25 |
jwilhelm |
Merge
|
changeset |
files
|
2017-11-22 |
coleenp |
Merge
|
changeset |
files
|
2017-11-21 |
glaubitz |
8191663: Zero variant broken after 8189170 and 8189871
|
changeset |
files
|
2017-11-21 |
ccheung |
8191739: [TESTBUG] test/hotspot/jtreg/runtime/LoadClass/TestResize.java fails to compile after JDK-8191580
|
changeset |
files
|
2017-11-21 |
ecaspole |
8191615: LogCompilation can show bytes
|
changeset |
files
|
2017-11-21 |
ccheung |
8188122: Path length limits on Windows leads to obscure class loading failures
|
changeset |
files
|
2017-11-21 |
iklam |
8191042: Deprecate VM option CheckEndorsedAndExtDirs
|
changeset |
files
|
2017-11-21 |
dlong |
8190817: deopt special-case for _return_register_finalizer is confusing and leads to bugs
|
changeset |
files
|
2017-11-21 |
gziemski |
8191580: open/test/hotspot/jtreg/runtime/LoadClass/TestResize fails on product build
|
changeset |
files
|
2017-11-21 |
rkennke |
8191562: Missing include in gcArguments.cpp breaks minimal JVM build
|
changeset |
files
|
2017-11-21 |
ihse |
8191203: Remove duplicated jimage.hpp
|
changeset |
files
|
2017-11-21 |
ehelin |
8182284: G1Analytics uses uninitialized fields
|
changeset |
files
|
2017-11-21 |
ihse |
8190418: Stop generating jvmtiEnvStub and jvmtiEnvRecommended
|
changeset |
files
|
2017-11-21 |
sballal |
8191401: [TESTBUG] serviceability/sa/ClhsdbFlags.java can fail due to UseJVMCICompiler
|
changeset |
files
|
2017-11-21 |
iveresov |
8043070: nmethod::verify_interrupt_point() shouldn't enter safepoint
|
changeset |
files
|
2017-11-20 |
dholmes |
Merge
|
changeset |
files
|
2017-11-20 |
dholmes |
8189170: Add option to disable stack overflow checking in primordial thread for use with JNI_CreateJavaJVM
|
changeset |
files
|
2017-11-20 |
epavlova |
8190975: [Graal] Tests which run with "--limit-modules java.base" could fail when Graal is used as JIT
|
changeset |
files
|
2017-11-20 |
smonteith |
8191338: aarch64: fails to build after 8189745
|
changeset |
files
|
2017-11-20 |
neliasso |
8160548: Inconsistent inlining behavior with CompileOnly
|
changeset |
files
|
2017-10-11 |
neliasso |
8169766: c1 + Xcomp reresolving call target every invocation
|
changeset |
files
|
2017-10-11 |
neliasso |
8160303: parse_method_pattern only scans 254 chars
|
changeset |
files
|
2017-11-20 |
neliasso |
8065838: compiler/relocations/TestPrintRelocations.java times out after 1920 seconds
|
changeset |
files
|
2017-11-20 |
eosterlund |
8189871: Refactor GC barriers to use declarative semantics
|
changeset |
files
|
2017-11-20 |
tschatzl |
Merge
|
changeset |
files
|
2017-11-20 |
tschatzl |
8186480: Remove warning when AssumeMP is true and ergonomics determines to use one worker thread
|
changeset |
files
|
2017-11-20 |
rehn |
8191373: Multiple NUMA nodes expected
|
changeset |
files
|
2017-11-20 |
rehn |
8191329: Deprecate DeferPollingPageLoopCount
|
changeset |
files
|
2017-11-20 |
rehn |
8191327: Deprecate DeferThrSuspendLoopCount
|
changeset |
files
|
2017-11-20 |
rehn |
8191326: Deprecate SafepointSpinBeforeYield
|
changeset |
files
|
2017-11-20 |
jiangli |
8187118: Remove appending -cp path to the boot class path at AppCDS dump time
|
changeset |
files
|
2017-11-30 |
sherman |
8192781: tools/jar/multiRelease/Basic.java test Basic.test09(): failure after change d34958
|
changeset |
files
|
2017-11-30 |
mchung |
8191942: Replace jdeps use of jdk.internal.util.jar.VersionedStream with new public API
|
changeset |
files
|
2017-11-29 |
ksrini |
8182108: javadoc makes up type variables for grandparent types
|
changeset |
files
|
2017-11-29 |
sherman |
8189611: JarFile versioned stream and real name support
|
changeset |
files
|
2017-11-29 |
ihse |
8191933: Use failure handler in run-test
|
changeset |
files
|
2017-11-29 |
psandoz |
8187237: Need to define the behaviour for 0 and 1 argument method type in StringConcatFactory.makeConcat
|
changeset |
files
|
2017-11-29 |
ihse |
8192067: Add fixpath to test image
|
changeset |
files
|
2017-11-29 |
psandoz |
8181175: Stream.concat behaves like terminal operation
|
changeset |
files
|
2017-11-29 |
prr |
Merge
|
changeset |
files
|
2017-11-29 |
prr |
Merge
|
changeset |
files
|
2017-11-28 |
serb |
8043334: Typo in javax/swing/JComponent.html
|
changeset |
files
|