sundar [Mon, 30 Jun 2014 20:23:16 +0530] rev 25248
8048718: JSON.parse('{"0":0, "64":0}') throws ArrayindexOutOfBoundsException
Reviewed-by: lagergren, hannesw, attila
sundar [Fri, 27 Jun 2014 21:54:16 +0530] rev 25247
8046013: TypeError: Cannot apply "with" to non script object
Reviewed-by: lagergren, hannesw
lagergren [Fri, 27 Jun 2014 10:47:44 +0200] rev 25246
8048505: ScriptingFunctions.readFully couldn't handle file names represented as ConsStrings
Reviewed-by: sundar, hannesw
attila [Thu, 26 Jun 2014 15:36:15 +0200] rev 25245
8047371: local variable declaration in TypeEvaluator should use ScriptObject.addOwnProperty instead of .set
Reviewed-by: jlaskey, lagergren
attila [Thu, 26 Jun 2014 13:12:32 +0200] rev 25244
8047357: More precise synthetic return + unreachable throw
Reviewed-by: lagergren, sundar
hannesw [Wed, 25 Jun 2014 14:36:24 +0200] rev 25243
8048079: Persistent code store is broken after optimistic types merge
Reviewed-by: sundar, jlaskey, attila
sundar [Wed, 25 Jun 2014 17:08:47 +0530] rev 25242
8048071: eval within 'with' statement does not use correct scope if with scope expression has a copy of eval
Reviewed-by: hannesw, jlaskey
attila [Tue, 24 Jun 2014 19:29:41 +0200] rev 25241
8048009: Type info caching accidentally defeated
Reviewed-by: hannesw, jlaskey
sundar [Tue, 24 Jun 2014 19:43:44 +0530] rev 25240
8047959: bindings created for declarations in eval code are not mutable
Reviewed-by: jlaskey, attila
hannesw [Mon, 23 Jun 2014 18:32:11 +0200] rev 25239
8046201: Avoid repeated flattening of nested ConsStrings
Reviewed-by: lagergren, attila
sundar [Mon, 23 Jun 2014 21:23:53 +0530] rev 25238
8047728: (function(x){var o={x:0}; with(o){delete x} return o.x})() evaluates to 0 instead of undefined
Reviewed-by: jlaskey, hannesw, attila
attila [Mon, 23 Jun 2014 10:59:33 +0200] rev 25237
8046905: apply on apply is broken
Reviewed-by: hannesw, lagergren
attila [Fri, 20 Jun 2014 12:25:00 +0200] rev 25236
8046921: Deoptimization type information peristence
Reviewed-by: hannesw, lagergren
sundar [Thu, 19 Jun 2014 20:36:03 +0530] rev 25235
8047369: Add regression tests for passing test cases of JDK-8024971
Reviewed-by: hannesw, jlaskey
lagergren [Thu, 19 Jun 2014 10:46:31 +0200] rev 25234
8047078: Fuzzing bug discovered when ArrayLiteralNodes weren't immutable
Reviewed-by: attila, sundar
katleman [Thu, 03 Jul 2014 11:37:57 -0700] rev 25233
Added tag jdk9-b21 for changeset e4ffc9bab6f2
duke [Wed, 05 Jul 2017 19:48:10 +0200] rev 25232
Merge
lana [Wed, 09 Jul 2014 10:41:04 -0700] rev 25231
Merge
lana [Tue, 01 Jul 2014 14:29:58 -0700] rev 25230
Merge
coffeys [Tue, 01 Jul 2014 15:17:55 +0100] rev 25229
7095856: OutputStreamHook doesn't handle null values
Reviewed-by: lancea, msheppar
katleman [Thu, 03 Jul 2014 11:36:35 -0700] rev 25228
Added tag jdk9-b21 for changeset a36678c24565
duke [Wed, 05 Jul 2017 19:48:02 +0200] rev 25227
Merge
lana [Wed, 09 Jul 2014 10:42:37 -0700] rev 25226
Merge
egahlin [Thu, 03 Jul 2014 18:20:42 +0200] rev 25225
8028474: sun/jvmstat/monitor/MonitoredVm/MonitorVmStartTerminate.sh timeout, leaves looping process
Reviewed-by: sla, jbachorik, rriggs
psandoz [Thu, 03 Jul 2014 09:30:25 +0200] rev 25224
8043327: Collectors.toMap studentToGPA example uses Functions.identity()
8043328: Typo in documentation of package java.util.stream
Reviewed-by: alanb, lancea
jmanson [Wed, 02 Jul 2014 14:14:17 -0700] rev 25223
8048840: File.createTempFile has uninformative failure message
Reviewed-by: martin, alanb
martin [Wed, 02 Jul 2014 10:21:23 -0700] rev 25222
8048990: ZipFile.entries() can't handle empty zip entry names
Summary: getEntryBytes should never return null pointer for entry names
Reviewed-by: sherman
alanb [Wed, 02 Jul 2014 10:03:40 +0100] rev 25221
8048891: Remove unused JObjC from jdk repository
Reviewed-by: mchung
weijun [Wed, 02 Jul 2014 17:03:47 +0800] rev 25220
8042053: Broken links to jarsigner and keytool docs in java.security package summary
Reviewed-by: xuelei
sla [Wed, 02 Jul 2014 08:41:59 +0200] rev 25219
8046883: com/sun/jdi/ProcessAttachTest.sh gets "java.io.IOException: Invalid process identifier" on windows
Reviewed-by: dcubed, dsamersoff, allwin
smarks [Tue, 01 Jul 2014 23:39:31 -0700] rev 25218
8048989: small errors in Collectors examples
Reviewed-by: darcy
Contributed-by: raoul@urma.com
ykantser [Tue, 01 Jul 2014 21:23:54 +0200] rev 25217
8048892: TEST_BUG: shell script tests need to be change to not use retired @debuggeeVMOptions mechanism
Reviewed-by: sla, jbachorik
weijun [Wed, 02 Jul 2014 09:48:32 +0800] rev 25216
8048511: Uninitialised memory in jdk/src/share/native/sun/security/jgss/wrapper/GSSLibStub.c
Reviewed-by: valeriep
valeriep [Tue, 01 Jul 2014 23:09:52 +0000] rev 25215
Merge
valeriep [Tue, 01 Jul 2014 20:35:43 +0000] rev 25214
8027575: b113 causing a lot of memory allocation and regression for wls_webapp_atomics
Summary: Reduce buffer allocation and do multiple cipher encryption/decryption calls.
Reviewed-by: xuelei, ascarpino
valeriep [Tue, 01 Jul 2014 20:35:30 +0000] rev 25213
8046046: Test sun/security/pkcs11/Signature/TestDSAKeyLength.java fails intermittently on Solaris 11 in 8u40 nightly
Summary: Override the upper limit to 1024 for SHA1withDSA when larger DSA key size is supported.
Reviewed-by: mullan, ascarpino
lana [Tue, 01 Jul 2014 14:28:51 -0700] rev 25212
Merge
prr [Tue, 01 Jul 2014 10:20:56 -0700] rev 25211
Merge
yan [Tue, 24 Jun 2014 12:27:37 +0400] rev 25210
7112454: TEST_BUG: java/awt/Choice/PopdownGeneratesMouseEvents/PopdownGeneratesMouseEvents.html failed
Reviewed-by: anthony, pchelko
Contributed-by: Andrei Eremeev <andrei.eremeev@oracle.com>
azvegint [Tue, 24 Jun 2014 10:36:35 +0400] rev 25209
8042094: Test javax/swing/JFileChooser/7036025/bug7036025.java fails with java.lang.NullPointerException on Windows x86
Reviewed-by: ahgross, art, pchelko, mschoene
ddehaven [Mon, 23 Jun 2014 13:05:27 -0700] rev 25208
Merge
prr [Mon, 23 Jun 2014 12:48:16 -0700] rev 25207
8043509: java.awt.Font gets initialized with the wrong font name for some Locales
Reviewed-by: bae, jgodinez
pchelko [Mon, 23 Jun 2014 22:15:09 +0400] rev 25206
8047798: Remove EventQueueDelegate
Reviewed-by: anthony, art
mchung [Fri, 20 Jun 2014 13:36:03 -0700] rev 25205
8044063: Remove com.sun.java.browser.* from jdk repo
Reviewed-by: darcy, alanb
prr [Fri, 20 Jun 2014 12:37:08 -0700] rev 25204
8042098: Test sun/java2d/AcceleratedXORModeTest.java fails on Windows
Reviewed-by: jgodinez
yan [Fri, 20 Jun 2014 16:48:30 +0400] rev 25203
8047180: Move functional tests AWT_Headless/Automated to OpenJDK repository
Reviewed-by: pchelko, alexsch
Contributed-by: Dmitriy Ermashov <dmitriy.ermashov@oracle.com>
yan [Thu, 19 Jun 2014 12:44:41 +0400] rev 25202
8044429: move awt automated tests for AWT_Modality to OpenJDK repository
Reviewed-by: pchelko
Contributed-by: Alexander Stepanov <alexander.v.stepanov@oracle.com>
henryjen [Wed, 18 Jun 2014 09:13:46 -0700] rev 25201
8046485: Add missing @since tag under javax.swing.*
Reviewed-by: alexsch, prr
prr [Wed, 18 Jun 2014 14:53:35 -0700] rev 25200
Merge
pchelko [Wed, 18 Jun 2014 13:21:59 +0400] rev 25199
8047061: [macosx] Crash when setting display mode
Reviewed-by: anthony, alexsch
azvegint [Tue, 17 Jun 2014 19:05:06 +0400] rev 25198
8040007: GtkFileDialog strips user inputted filepath
Reviewed-by: anthony, serb
pchelko [Mon, 16 Jun 2014 17:13:58 +0400] rev 25197
8046221: [TEST_BUG] Cleanup datatransfer tests
Reviewed-by: anthony, alexsch
serb [Thu, 12 Jun 2014 00:43:14 +0400] rev 25196
8033786: White flashing when opening Dialogs and Menus using Nimbus with dark background
Reviewed-by: alexsch, anthony
serb [Thu, 12 Jun 2014 00:32:33 +0400] rev 25195
8029455: [JLightweightFrame] support scaled painting
Reviewed-by: anthony, ant
serb [Thu, 12 Jun 2014 00:19:00 +0400] rev 25194
8040271: Uninitialised memory in jdk/src/windows/native/sun/windows: awt_List.cpp, awt_InputMethod.cpp
Reviewed-by: pchelko, prr
darcy [Wed, 11 Jun 2014 13:25:15 -0700] rev 25193
8043549: Fix raw and unchecked lint warnings in javax.swing.text.*
Reviewed-by: prr
henryjen [Thu, 05 Jun 2014 13:59:01 -0700] rev 25192
8044551: Fix raw and unchecked lint warnings in platform-specific sun.awt files
8044396: Fix raw and unchecked lint warnings in platform-specific sun.java2d.*
Reviewed-by: darcy, prr
yan [Wed, 11 Jun 2014 17:23:56 +0400] rev 25191
8043972: Remove wrong copyright notice in jdk/test/java/awt/Frame/DecoratedExceptions/DecoratedExceptions.java
Reviewed-by: anthony
Contributed-by: Dmitriy Ermashov <dmitriy.ermashov@oracle.com>
serb [Wed, 11 Jun 2014 14:38:50 +0400] rev 25190
8042103: Deserialization of empty java.awt.geom.Path2D will cause an exception
Reviewed-by: bae, flar
serb [Wed, 11 Jun 2014 14:21:12 +0400] rev 25189
8041644: [OGL] clip is ignored during surface->sw blit
Reviewed-by: bae, prr
ascarpino [Tue, 01 Jul 2014 09:46:20 -0700] rev 25188
8015081: javax.security.auth.Subject.toString() throws NPE
Reviewed-by: xuelei, weijun
Contributed-by: Jamil Nimeh <jamil.j.nimeh@oracle.com>
prappo [Tue, 01 Jul 2014 14:44:37 +0100] rev 25187
8048874: Replace uses of 'new Byte', 'new Short' and 'new Character' with appropriate alternative across core classes
Reviewed-by: chegar, psandoz, prappo
Contributed-by: Otavio Santana <otaviojava@java.net>
prappo [Tue, 01 Jul 2014 15:12:59 +0100] rev 25186
8048267: Replace uses of 'new Long()' with appropriate alternative across core classes
Reviewed-by: chegar, psandoz, prappo
Contributed-by: Otavio Santana <otaviojava@java.net>
jbachorik [Tue, 01 Jul 2014 17:58:14 +0200] rev 25185
8044427: [test] sun/management/jmxremote/startstop/JMXStartStopTest times out intermittently on Solaris/Sparcv9
Reviewed-by: sla
coffeys [Tue, 01 Jul 2014 16:51:44 +0100] rev 25184
7095856: OutputStreamHook doesn't handle null values
Reviewed-by: lancea, msheppar
sla [Tue, 01 Jul 2014 16:08:45 +0200] rev 25183
8048710: Use ServiceLoader for the jvmstat protocols
Reviewed-by: alanb
jbachorik [Tue, 01 Jul 2014 15:00:33 +0200] rev 25182
8048193: [tests] Replace JPS and stdout based PID retrieval by Process.getPid()
Reviewed-by: sla
jbachorik [Tue, 01 Jul 2014 11:47:36 +0200] rev 25181
8038794: java/lang/management/ThreadMXBean/SynchronizationStatistics.java fails intermittently
Reviewed-by: sla
sla [Tue, 01 Jul 2014 10:40:14 +0200] rev 25180
8048687: [TESTBUG] com/sun/jdi/ExclusiveBind.java "Could not find or load main class"
Reviewed-by: jbachorik, egahlin, dholmes
darcy [Mon, 30 Jun 2014 18:17:46 -0700] rev 25179
8048839: Reverse sense of -Xlint options in build of jdk repo
Reviewed-by: tbell, mikael
yan [Mon, 30 Jun 2014 16:32:36 +0400] rev 25178
8046434: Fix doclint warnings from javax.swing.plaf.metal package
Reviewed-by: alexsch
Contributed-by: Andrei Eremeev <andrei.eremeev@oracle.com>
mduigou [Fri, 27 Jun 2014 10:26:39 -0700] rev 25177
8048207: Collections.checkedQueue.offer() calls add on wrapped queue
Reviewed-by: psandoz
henryjen [Mon, 16 Jun 2014 09:44:54 -0700] rev 25176
8047721: @since should have JDK version
Reviewed-by: darcy, wetmore
igerasim [Fri, 27 Jun 2014 08:03:35 +0400] rev 25175
8048080: (smartcardio) javax.smartcardio.Card.openLogicalChannel() dosn't work on MacOSX
Reviewed-by: valeriep
naoto [Thu, 26 Jun 2014 10:48:43 -0700] rev 25174
8039317: Read currency.data as a resource
Reviewed-by: alanb, chegar
yan [Thu, 26 Jun 2014 15:59:57 +0400] rev 25173
8044276: Fix doclint warnings (missing javadoc tags) in javax.swing.plaf.synth
Reviewed-by: alexsch
Contributed-by: Rocky Sloan <rocky.sloan@oracle.com>
yan [Thu, 26 Jun 2014 15:58:06 +0400] rev 25172
8044281: Fix doclint warnings (missing javadoc tags) in javax.swing.table
Reviewed-by: alexsch
Contributed-by: Rocky Sloan <rocky.sloan@oracle.com>
mduigou [Wed, 25 Jun 2014 12:36:03 -0700] rev 25171
8047795: Collections.checkedList checking bypassed by List.replaceAll
Reviewed-by: psandoz, chegar
michaelm [Wed, 25 Jun 2014 15:55:42 +0100] rev 25170
8029607: Type of Service (TOS) cannot be set in IPv6 header
Reviewed-by: alanb
weijun [Wed, 25 Jun 2014 18:49:02 +0800] rev 25169
8048073: Cannot read ccache entry with a realm-less service name
Reviewed-by: xuelei
jbachorik [Wed, 25 Jun 2014 09:43:47 +0200] rev 25168
8038826: sun/management/jmxremote/startstop/JMXStartStopTest.java fails with "should report port in use"
Reviewed-by: sla
mchung [Tue, 24 Jun 2014 16:22:57 -0700] rev 25167
8047904: Runtime.loadLibrary throws SecurityException when security manager is installed
Reviewed-by: alanb, psandoz
darcy [Tue, 24 Jun 2014 14:05:47 -0700] rev 25166
8046273: Add overrides lint warning to build of jdk repository
Reviewed-by: tbell
jbachorik [Tue, 24 Jun 2014 19:59:26 +0200] rev 25165
8048005: Add test timing information to JMXStartStopTest
Reviewed-by: egahlin, dfuchs
jbachorik [Tue, 24 Jun 2014 19:58:03 +0200] rev 25164
8047073: Some javax/management/ fails with JFR
Reviewed-by: egahlin, dfuchs
darcy [Tue, 24 Jun 2014 10:46:08 -0700] rev 25163
8048014: Update java.lang.SafeVararags for private methods
Reviewed-by: lancea, abuckley
yan [Tue, 24 Jun 2014 16:57:02 +0400] rev 25162
8043967: Fix doclint warnings for java.awt
Reviewed-by: pchelko
Contributed-by: Alexander Stepanov <alexander.v.stepanov@oracle.com>
chegar [Tue, 24 Jun 2014 10:25:56 +0100] rev 25161
8047674: java/net/URLPermission/nstest/lookup.sh NoClassDefFoundError when run in concurrent mode
Reviewed-by: alanb
sjiang [Tue, 24 Jun 2014 11:09:57 +0200] rev 25160
8038321: RMIConnector_NPETest.java can't start rmid if running on fastdebug or Solaris-sparc
Reviewed-by: sla, jbachorik
yan [Tue, 24 Jun 2014 10:47:30 +0400] rev 25159
8044256: Fix doclint warnings (missing javadoc tags) in javax.swing.plaf.nimbus
Reviewed-by: alexsch
Contributed-by: Rocky Sloan <rocky.sloan@oracle.com>
sherman [Mon, 23 Jun 2014 12:12:30 -0700] rev 25158
8042369: Remove duplicated java.time classes in build.tools.tzdb
Summary: removed duplicated classes in builder
Reviewed-by: rriggs
joehw [Mon, 23 Jun 2014 10:40:20 -0700] rev 25157
5077522: Duration.compare incorrect for some values
Reviewed-by: lancea, dfuchs
kizune [Mon, 23 Jun 2014 18:09:35 +0400] rev 25156
8046337: Test closed/tools/pack200/MemoryAllocatorTest.java fails on windows-i586
Reviewed-by: ksrini
sla [Mon, 23 Jun 2014 15:51:41 +0200] rev 25155
8044772: TempDirTest.java still times out with -Xcomp
Reviewed-by: dholmes
yan [Mon, 23 Jun 2014 10:57:22 +0400] rev 25154
8040901: fix doclint block tag issues in swing event classes
Reviewed-by: alexsch
Contributed-by: Steven Sides <steve.sides@oracle.com>
ksrini [Fri, 20 Jun 2014 10:10:27 -0700] rev 25153
8044866: Fix raw and unchecked lint warnings in asm
Reviewed-by: darcy
yan [Fri, 20 Jun 2014 19:03:57 +0400] rev 25152
8046445: Fix doclint warnings for javax.swing.plaf.multi
Reviewed-by: alexsch
Contributed-by: Alexander Stepanov <alexander.v.stepanov@oracle.com>
weijun [Fri, 20 Jun 2014 10:27:10 +0800] rev 25151
8029994: Support "include" and "includedir" in krb5.conf
Reviewed-by: mullan
mchung [Thu, 19 Jun 2014 13:12:08 -0700] rev 25150
8047387: Generate different version of java.policy file for windows 32-bit and 64-bit
Reviewed-by: erikj, tbell
kizune [Thu, 19 Jun 2014 18:07:02 +0400] rev 25149
8000650: unpack200.exe should check gzip crc
Reviewed-by: ksrini
yan [Thu, 19 Jun 2014 16:57:14 +0400] rev 25148
8046446: Fix doclint warnings in javax.swing.text.html package
Reviewed-by: pchelko
Contributed-by: Andrei Eremeev <andrei.eremeev@oracle.com>
yan [Thu, 19 Jun 2014 16:54:59 +0400] rev 25147
8046895: Fix doclint warnings in javax.swing.text.html.parser package
Reviewed-by: pchelko
Contributed-by: Andrei Eremeev <andrei.eremeev@oracle.com>
sla [Thu, 19 Jun 2014 12:56:16 +0200] rev 25146
8046024: JDI shared memory transport failed with "Observed abandoned IP mutex"
Reviewed-by: alanb
darcy [Wed, 18 Jun 2014 18:27:39 -0700] rev 25145
8044715: Add finally lint warning to build of jdk repository
Reviewed-by: henryjen, tbell
prr [Wed, 18 Jun 2014 13:14:15 -0700] rev 25144
Merge
aivanov [Wed, 11 Jun 2014 10:53:27 +0400] rev 25143
8046391: Hang displaying JFileChooser with Windows L&F
Reviewed-by: anthony, serb
darcy [Mon, 09 Jun 2014 16:24:47 -0700] rev 25142
8046271: Fix overrides lint warnings in Apple laf code
Reviewed-by: alanb, prr
prr [Mon, 09 Jun 2014 11:58:27 -0700] rev 25141
Merge
darcy [Mon, 09 Jun 2014 11:47:18 -0700] rev 25140
8042870: Fix raw and unchecked warnings in sun.print
Reviewed-by: prr
serb [Mon, 09 Jun 2014 20:23:26 +0400] rev 25139
8039901: jdk/src/share/classes/com/sun/media/sound/services/<platform> appear not to be used
Reviewed-by: amenkov, azvegint
aivanov [Mon, 09 Jun 2014 18:10:49 +0400] rev 25138
8046239: Build failure in 9-client on all non-Windows platforms
Reviewed-by: anthony, serb, alexp
yan [Mon, 09 Jun 2014 14:59:45 +0400] rev 25137
8044765: Move functional tests AWT_SystemTray/Automated to openjdk repository
Reviewed-by: pchelko
Contributed-by: Dmitriy Ermashov <dmitriy.ermashov@oracle.com>
serb [Mon, 09 Jun 2014 13:03:03 +0400] rev 25136
8046245: JDK 9 client build failure on Solaris
Reviewed-by: prr
aivanov [Fri, 06 Jun 2014 17:51:32 +0400] rev 25135
8039383: NPE when changing Windows theme
Reviewed-by: pchelko, anthony
pchelko [Fri, 06 Jun 2014 14:58:41 +0400] rev 25134
8041464: [TEST_BUG] CustomClassLoaderTransferTest does not support OS X
Reviewed-by: azvegint, serb
pchelko [Fri, 06 Jun 2014 14:52:07 +0400] rev 25133
8041990: [macosx] Language specific keys does not work in applets when opened outside the browser
Reviewed-by: alexsch, serb
pchelko [Fri, 06 Jun 2014 13:52:49 +0400] rev 25132
8044516: [macosx] ScreenPopupFactory uses native method that could be avoided
Reviewed-by: anthony, serb
darcy [Thu, 05 Jun 2014 23:17:05 -0700] rev 25131
8044553: Fix raw and unchecked lint warnings in javax.sound.*
Reviewed-by: prr
henryjen [Thu, 05 Jun 2014 10:37:24 -0700] rev 25130
8044855: Add missing @since tag under java.beans.*
Reviewed-by: prr, malenkov
yan [Wed, 04 Jun 2014 17:24:13 +0400] rev 25129
8044157: [TEST_BUG] Improve recently submitted AWT_Mixing tests
Reviewed-by: pchelko
serb [Wed, 04 Jun 2014 17:14:56 +0400] rev 25128
8043979: Javadoc cleanup of javax.sound.sampled package
Reviewed-by: pchelko, azvegint
serb [Wed, 04 Jun 2014 16:55:06 +0400] rev 25127
8041129: [OGL] surface->sw blit is extremely slow
8017626: [OGL] Translucent VolatileImages don't paint correctly
Reviewed-by: bae, flar
darcy [Tue, 03 Jun 2014 17:03:29 -0700] rev 25126
8044698: Fix finally lint warnings in javax.swing
Reviewed-by: prr, henryjen
darcy [Tue, 03 Jun 2014 12:32:25 -0700] rev 25125
8044694: Fix finally lint warnings in sun.print
Reviewed-by: prr
malenkov [Tue, 03 Jun 2014 21:03:35 +0400] rev 25124
7084904: Introspector returns isX() from base package-private class that throws exception
Reviewed-by: serb
darcy [Tue, 03 Jun 2014 09:22:59 -0700] rev 25123
8042860: Fix raw and unchecked warnings in java.beans
Reviewed-by: malenkov, alanb, mduigou
rriggs [Tue, 03 Jun 2014 11:18:03 -0400] rev 25122
8044460: Cleanup new Boolean and single character strings
Reviewed-by: pchelko, serb, rriggs
Contributed-by: otaviopolianasantana@gmail.com
pchelko [Mon, 02 Jun 2014 15:25:43 +0400] rev 25121
8043807: Incorrect StackTrace in IOException thrown from ClipboardTransferable
Reviewed-by: anthony, serb
dmarkov [Mon, 02 Jun 2014 14:20:02 +0400] rev 25120
8042465: Applet menus not rendering when browser is full screen on Mac
Reviewed-by: anthony, pchelko
azvegint [Fri, 30 May 2014 13:16:51 +0400] rev 25119
8031471: Test closed/java/awt/dnd/FileDialogDropTargetTest/FileDialogDropTargetTest.java fails on Solaris zones virtual hosts
Reviewed-by: anthony, serb
malenkov [Fri, 30 May 2014 15:24:42 +0400] rev 25118
8007563: When checking the default behaviour for a scroll tab layout and checking the 'opaque' checkbox, the area behind tabs is not red.
Reviewed-by: alexsch, serb
yan [Fri, 30 May 2014 14:23:25 +0400] rev 25117
8044172: [TEST_BUG] Move regtests for 4523758 and AltPlusNumberKeyCombinationsTest to jdk
Reviewed-by: pchelko
serb [Fri, 30 May 2014 14:06:50 +0400] rev 25116
8040113: File not initialized in src/share/native/sun/awt/giflib/dgif_lib.c
Reviewed-by: pchelko, prr
anashaty [Fri, 30 May 2014 11:20:03 +0400] rev 25115
8032788: ImageIcon constructor throws an NPE and hangs when passed a null String parameter
Reviewed-by: pchelko, serb
anashaty [Thu, 29 May 2014 17:31:41 +0400] rev 25114
8028617: Dvorak keyboard mapping not honored when ctrl key pressed
Reviewed-by: pchelko, anthony
alexsch [Wed, 28 May 2014 15:36:10 +0400] rev 25113
8043705: Can't exit color chooser dialog when running as an applet
Reviewed-by: serb, pchelko
prr [Tue, 27 May 2014 13:58:00 -0700] rev 25112
Merge
prr [Tue, 27 May 2014 12:50:51 -0700] rev 25111
8035301: Eliminate dependency on sun.text from font code
Reviewed-by: mchung, jgodinez
malenkov [Mon, 26 May 2014 18:01:59 +0400] rev 25110
8019180: Use JComboBox as it's own ActionListener leads to unexpected behaviour
Reviewed-by: alexsch, serb
serb [Mon, 26 May 2014 16:37:25 +0400] rev 25109
8009883: REGRESSION: test/closed/javax/swing/AbstractButton/4246045/bug4246045.java fails
Summary: remove redundant focus handler that was causing a second focus event
Reviewed-by: alexsch, pchelko
Contributed-by: peter.brunet@oracle.com
yan [Mon, 26 May 2014 15:50:10 +0400] rev 25108
8041915: Move 8 awt tests to OpenJDK regression tests tree
Reviewed-by: pchelko, alexsch
Contributed-by: Dmitriy Ermashov <dmitriy.ermashov@oracle.com>
alexsch [Mon, 26 May 2014 14:33:49 +0400] rev 25107
8040291: [macosx] Http-Images are not fully loaded when using ImageIcon
Reviewed-by: serb, pchelko
prr [Fri, 23 May 2014 11:13:54 -0700] rev 25106
Merge
pchelko [Fri, 23 May 2014 19:48:25 +0400] rev 25105
8031485: [macosx] Combo box consuming escape key events
Reviewed-by: serb, alexsch
pchelko [Fri, 23 May 2014 19:43:14 +0400] rev 25104
8043610: Sorting columns in JFileChooser fails with AppContext NPE
Reviewed-by: anthony, alexsch
omajid [Fri, 23 May 2014 11:04:37 -0400] rev 25103
8043805: Allow using a system-installed libjpeg
Reviewed-by: andrew, anthony, prr
prr [Thu, 22 May 2014 13:54:52 -0700] rev 25102
8042850: [parfait]: Extra unused entries in ICU ScriptCodes enum
Reviewed-by: bae, srl
prr [Thu, 22 May 2014 13:54:08 -0700] rev 25101
8042855: [parfait] Potential null pointer dereference in IndicLayoutEngine.cpp
Reviewed-by: bae, srl
malenkov [Thu, 22 May 2014 21:05:30 +0400] rev 25100
8043627: NPE in SynthContext in plugin mode
Reviewed-by: alexsch, serb, pchelko
pchelko [Thu, 22 May 2014 15:46:50 +0400] rev 25099
8043646: libosxapp.dylib fails to build on Mac OS 10.9 with clang
Reviewed-by: anthony, serb
prr [Wed, 21 May 2014 11:12:18 -0700] rev 25098
8039394: Compiler warnings about C++ exceptions in windows printing code
Reviewed-by: bae, jgodinez
prr [Wed, 21 May 2014 10:50:14 -0700] rev 25097
8016451: Scary messages emitted by build.tools.generatenimbus.PainterGenerator during build
Reviewed-by: alexsch, anthony
malenkov [Wed, 21 May 2014 16:48:04 +0400] rev 25096
8043456: KSS: javax.swing.plaf.basic.BasicInternalFrameTitlePane#postClosingEvent
Reviewed-by: alexsch, serb
alexsch [Wed, 21 May 2014 14:13:17 +0400] rev 25095
8041561: Inconsistent opacity behaviour between JCheckBox and JRadioButton
Reviewed-by: malenkov
alexsch [Wed, 21 May 2014 14:07:06 +0400] rev 25094
8036110: In TextField can only select text visible or to the left of the cursor
Reviewed-by: serb, pchelko
darcy [Tue, 20 May 2014 09:36:22 -0700] rev 25093
8042864: Fix raw and unchecked warnings in javax.print
Reviewed-by: prr, henryjen
ddehaven [Mon, 19 May 2014 23:21:39 +0400] rev 25092
8026385: [macosx] (awt) setjmp/longjmp changes the process signal mask on OS X
Summary: Use _setjmp/_longjmp instead
Reviewed-by: prr, anthony
Contributed-by: David DeHaven <david.dehaven@oracle.com>
darcy [Mon, 19 May 2014 10:03:58 -0700] rev 25091
8042871: Fix raw and unchecked warnings in sun.audio
Reviewed-by: serb
anashaty [Mon, 19 May 2014 16:48:41 +0400] rev 25090
8038000: java.awt.image.RasterFormatException: Incorrect scanline stride
Reviewed-by: bae, serb
malenkov [Fri, 16 May 2014 15:57:06 +0400] rev 25089
8043153: KSS: javax.swing.plaf.synth.SynthParser#startColor
Reviewed-by: alexsch, serb
malenkov [Fri, 16 May 2014 15:51:57 +0400] rev 25088
8043152: KSS: javax.swing.plaf.synth.SynthContext
Reviewed-by: alexsch, serb
malenkov [Fri, 16 May 2014 15:46:24 +0400] rev 25087
8043151: KSS: javax.swing.plaf.nimbus.AbstractRegionPainter#getComponentColor
Reviewed-by: alexsch, serb
ddehaven [Wed, 18 Jun 2014 12:52:14 -0700] rev 25086
8043340: [macosx] Fix hard-wired paths to JavaVM.framework
Summary: Build system tweaks to allow building with Xcode 5 and on OS X 10.9 and later
Reviewed-by: erikj, henryjen, dholmes
katleman [Thu, 03 Jul 2014 11:37:18 -0700] rev 25085
Added tag jdk9-b21 for changeset 843911d61b95
duke [Wed, 05 Jul 2017 19:47:36 +0200] rev 25084
Merge
lana [Wed, 09 Jul 2014 10:42:04 -0700] rev 25083
Merge
lana [Tue, 01 Jul 2014 14:26:52 -0700] rev 25082
Merge
amurillo [Fri, 20 Jun 2014 11:10:18 -0700] rev 25081
Merge
twisti [Thu, 19 Jun 2014 12:50:52 -0700] rev 25080
Merge
mikael [Mon, 16 Jun 2014 16:27:41 -0700] rev 25079
8046769: Set T family feature bit on Niagara systems
Reviewed-by: kvn, iveresov
iignatyev [Mon, 16 Jun 2014 15:12:24 +0400] rev 25078
8044742: testlibrary_tests/whitebox/vm_flags/BooleanTest.java NoClassDefFoundError: com/oracle/java/testlibrary/JDKToolFinder
Reviewed-by: kvn, roland
jmasa [Thu, 19 Jun 2014 09:44:12 -0700] rev 25077
Merge
jmasa [Wed, 18 Jun 2014 12:39:57 -0700] rev 25076
Merge
jwilhelm [Wed, 18 Jun 2014 13:02:33 +0000] rev 25075
Merge
jwilhelm [Thu, 12 Jun 2014 20:15:51 +0200] rev 25074
8046715: Add a way to verify an extended set of command line options
Summary: Added arguments_ext.cpp to make place for initialization of extended features
Reviewed-by: sla, mgronlun
tschatzl [Wed, 18 Jun 2014 13:25:40 +0200] rev 25073
8043722: Swapped usage of idx_t and bm_word_t types in parMarkBitMap.cpp
Summary: Clean up usage of idx_t and uintptr_t when using it in conjunction with BitMap::set_map(), casting to the appropriate type. Fixes compilation on S390.
Reviewed-by: tschatzl
Contributed-by: Dan Horak <dhorak@redhat.com>
jwilhelm [Fri, 13 Jun 2014 17:07:39 -0400] rev 25072
8046408: Build failure from multiple ptrace.h
Summary: prefer <sys/ptrace.h> over <linux/ptrace.h>
Reviewed-by: sla, mikael
Contributed-by: kim.barrett@oracle.com
amurillo [Fri, 13 Jun 2014 19:05:56 -0700] rev 25071
Merge
pliden [Fri, 13 Jun 2014 13:46:06 +0200] rev 25070
8044796: G1: Enable G1CollectedHeap::stop()
Reviewed-by: brutisso, sjohanss
dcubed [Wed, 18 Jun 2014 14:21:28 -0700] rev 25069
8047156: cleanup more non-indent white space issues prior to Contended Locking cleanup bucket
Summary: Checkpoint some missed do_space_filter.ksh cleanups for Contended Locking.
Reviewed-by: sspitsyn, lfoltan, coleenp
iveresov [Wed, 18 Jun 2014 12:21:39 -0700] rev 25068
Merge
iveresov [Wed, 18 Jun 2014 10:54:32 -0700] rev 25067
8046684: sharedRuntime.cpp...assert(((nmethod*)cb)->is_at_poll_or_poll_return(pc)) failed: safepoint polling: type must be poll
Summary: Emit a poll relocation for the testl in is_polling_page_far() on x86
Reviewed-by: vlivanov, roland
coleenp [Wed, 18 Jun 2014 13:58:13 -0400] rev 25066
8039150: host_klass invariant fails when verifying newly loaded JSR-292 anonymous classes
Summary: Initialize host_klass while parsing the class with the other initializations.
Reviewed-by: sspitsyn, stefank
ddehaven [Tue, 17 Jun 2014 11:18:10 -0700] rev 25065
8043340: [macosx] Fix hard-wired paths to JavaVM.framework
Summary: Build system tweaks to allow building with Xcode 5 and on OS X 10.9 and later
Reviewed-by: erikj, henryjen, dholmes
dcubed [Tue, 17 Jun 2014 12:54:01 -0700] rev 25064
8046758: cleanup non-indent white space issues prior to Contended Locking cleanup bucket
Summary: Checkpoint do_space_filter.ksh cleanups for Contended Locking.
Reviewed-by: sspitsyn, coleenp
dcubed [Fri, 13 Jun 2014 19:07:11 -0700] rev 25063
Merge
dsamersoff [Fri, 13 Jun 2014 05:10:44 -0700] rev 25062
8038392: Generating prelink cache breaks JAVA 'jinfo' utility normal behaviour
Summary: Better parsing of /proc/pid/maps in sa
Reviewed-by: sspitsyn, sla
dcubed [Thu, 12 Jun 2014 15:57:16 -0700] rev 25061
8046287: [TESTBUG] runtime/Thread/TestThreadDumpMonitorContention.java failed error_cnt=12
Summary: Added a new header waiting pattern to catch the case where the target thread waiting on a condition (like a VM op); several other test improvements
Reviewed-by: sspitsyn, dholmes
lfoltan [Thu, 12 Jun 2014 13:37:53 -0400] rev 25060
6961433: Revisit need to disable Windows C++ compiler optimisation of sharedRuntimeTrig.cpp.
Summary: Remove pragma optimize ("", off) to turn off optimization for WIN32.
Reviewed-by: coleenp, dcubed, kvn
dsimms [Thu, 12 Jun 2014 11:34:35 +0200] rev 25059
8046662: Check JNI ReleaseStringChars / ReleaseStringUTFChars verify_guards test inverted
Summary: negative verify_guards when testing for corruption
Reviewed-by: sla, fparain
dsimms [Wed, 11 Jun 2014 18:34:09 +0200] rev 25058
8043224: -Xcheck:jni improvements to exception checking and excessive local refs
Summary: Warning when not checking exceptions from function that require so, also when local refs expand beyond capacity.
Reviewed-by: zgu, coleenp, hseigel
hseigel [Wed, 11 Jun 2014 09:58:23 -0400] rev 25057
8031819: Remove legacy jdk checks and code
Summary: Delete old jdk specific code.
Reviewed-by: dholmes, coleenp, zgu, lfoltan
dsimms [Wed, 11 Jun 2014 12:09:12 +0200] rev 25056
6311046: -Xcheck:jni should support checking of GetPrimitiveArrayCritical.
Summary: Wrapped memory with standard bounds checking "GuardedMemory".
Reviewed-by: zgu, fparain, dcubed
dcubed [Tue, 10 Jun 2014 20:24:48 -0700] rev 25055
Merge
hseigel [Tue, 10 Jun 2014 14:04:37 -0400] rev 25054
8044738: Check attribute_length of EnclosingMethod attribute
Summary: Add check that attribute_length == 4.
Reviewed-by: fparain, coleenp, lfoltan
sla [Mon, 09 Jun 2014 11:03:09 +0200] rev 25053
8044797: Building with clang gives: fatal error: file '...' has been modified since the precompiled header was built
Reviewed-by: dholmes, dcubed
ctornqvi [Fri, 06 Jun 2014 14:46:42 +0200] rev 25052
8043492: ad_x86_64_misc.obj : error LNK2011: precompiled object not linked in; image may not run
Summary: Added _build_pch_file.obj to LD_FLAGS and cleaned up support for older Visual Studio versions
Reviewed-by: twisti, lfoltan, sla, kvn
sla [Wed, 04 Jun 2014 11:05:30 +0200] rev 25051
8044107: Add Diagnostic Command to list all ClassLoaders
Reviewed-by: mgerdin, stefank
miauno [Mon, 02 Jun 2014 17:21:15 +0200] rev 25050
8044540: serviceability/sa/jmap-hashcode/Test8028623.java should be quarantined
Reviewed-by: sla
katleman [Thu, 03 Jul 2014 11:36:49 -0700] rev 25049
Added tag jdk9-b21 for changeset 783e13910e74
lana [Wed, 09 Jul 2014 10:41:00 -0700] rev 25048
Merge
lana [Tue, 01 Jul 2014 14:26:31 -0700] rev 25047
Merge
prr [Tue, 01 Jul 2014 10:20:34 -0700] rev 25046
Merge
mchung [Fri, 20 Jun 2014 13:35:56 -0700] rev 25045
8044063: Remove com.sun.java.browser.* from jdk repo
Reviewed-by: darcy, alanb
joehw [Mon, 30 Jun 2014 18:04:13 -0700] rev 25044
8023276: Java SE should include the full DOM API from JAXP
Reviewed-by: lancea, mchung, alanb
darcy [Mon, 30 Jun 2014 14:27:37 -0700] rev 25043
8048302: Update bug reporting URL in make/Javadoc.gmk
8048321: Enable doclint warnings in build of docs from langtools
Reviewed-by: tbell
mikael [Tue, 24 Jun 2014 20:29:52 -0700] rev 25042
8047740: Add hotspot testset to jprt.properties
Reviewed-by: dholmes
mduigou [Tue, 24 Jun 2014 15:21:47 -0700] rev 25041
8047925: Add mercurial version checks to get_source.sh
Reviewed-by: tbell, mikael
mikael [Mon, 23 Jun 2014 14:08:45 -0700] rev 25040
8047763: Recognize sparc64 as a sparc platform
Reviewed-by: dholmes
prr [Wed, 18 Jun 2014 13:12:58 -0700] rev 25039
Merge
prr [Mon, 09 Jun 2014 11:58:07 -0700] rev 25038
Merge
prr [Tue, 27 May 2014 13:57:42 -0700] rev 25037
Merge
prr [Fri, 23 May 2014 11:16:31 -0700] rev 25036
Merge
omajid [Fri, 23 May 2014 11:04:32 -0400] rev 25035
8043805: Allow using a system-installed libjpeg
Reviewed-by: andrew, anthony, prr
ddehaven [Wed, 18 Jun 2014 12:52:13 -0700] rev 25034
8043340: [macosx] Fix hard-wired paths to JavaVM.framework
Summary: Build system tweaks to allow building with Xcode 5 and on OS X 10.9 and later
Reviewed-by: erikj, henryjen, dholmes
katleman [Thu, 03 Jul 2014 11:36:33 -0700] rev 25033
Added tag jdk9-b21 for changeset 4b8db1aec2a3
duke [Wed, 05 Jul 2017 19:47:11 +0200] rev 25032
Added tag jdk9-b21 for changeset 28dd0c7beb3c
duke [Wed, 05 Jul 2017 19:47:10 +0200] rev 25031
Merge
duke [Wed, 05 Jul 2017 19:47:07 +0200] rev 25030
Merge
katleman [Thu, 26 Jun 2014 12:51:49 -0700] rev 25029
Added tag jdk9-b20 for changeset d77065991eb8
duke [Wed, 05 Jul 2017 19:47:04 +0200] rev 25028
Merge
katleman [Thu, 26 Jun 2014 12:51:36 -0700] rev 25027
Added tag jdk9-b20 for changeset 02490297734b
duke [Wed, 05 Jul 2017 19:47:01 +0200] rev 25026
Merge
katleman [Thu, 26 Jun 2014 12:51:35 -0700] rev 25025
Added tag jdk9-b20 for changeset 6dbc3c71c0e2
duke [Wed, 05 Jul 2017 19:46:58 +0200] rev 25024
Merge
katleman [Thu, 26 Jun 2014 12:51:50 -0700] rev 25023
Added tag jdk9-b20 for changeset 7fb8003ec760
duke [Wed, 05 Jul 2017 19:46:55 +0200] rev 25022
Merge
katleman [Thu, 26 Jun 2014 12:51:17 -0700] rev 25021
Added tag jdk9-b20 for changeset c9ca62c6a329
duke [Wed, 05 Jul 2017 19:46:52 +0200] rev 25020
Merge
katleman [Thu, 26 Jun 2014 12:51:38 -0700] rev 25019
Added tag jdk9-b20 for changeset 8c82c02495e7
duke [Wed, 05 Jul 2017 19:46:49 +0200] rev 25018
Merge
katleman [Thu, 26 Jun 2014 12:51:26 -0700] rev 25017
Added tag jdk9-b20 for changeset e9f01656f118
katleman [Thu, 26 Jun 2014 12:51:14 -0700] rev 25016
Added tag jdk9-b20 for changeset 3abb2de3cdb3
duke [Wed, 05 Jul 2017 19:46:41 +0200] rev 25015
Added tag jdk9-b20 for changeset 89731ae72a76
duke [Wed, 05 Jul 2017 19:46:40 +0200] rev 25014
Merge
duke [Wed, 05 Jul 2017 19:46:37 +0200] rev 25013
Merge
lana [Fri, 20 Jun 2014 10:15:13 -0700] rev 25012
Merge
lana [Wed, 18 Jun 2014 10:54:24 -0700] rev 25011
Merge
mcimadamore [Wed, 18 Jun 2014 13:51:50 +0100] rev 25010
8043253: Slow javac compile times in JDK 8
Summary: Enable on-demand diagnostic source position completion
Reviewed-by: jjg, vromero
jlahoda [Wed, 18 Jun 2014 10:44:16 +0200] rev 25009
8046916: Type parameter annotations don't work with multiple type parameters
Summary: When reading type variable's annotations out of the owner's type annotations, use the type variable's index in owner to exclude annotations belonging to other type variables.
Reviewed-by: jfranck, emc
vromero [Tue, 17 Jun 2014 17:33:01 +0100] rev 25008
8036953: Fix timing of varargs access check, per JDK-8016205
Reviewed-by: mcimadamore, dlsmith
pgovereau [Tue, 17 Jun 2014 11:11:59 -0400] rev 25007
8038975: Access control in enhanced for
Reviewed-by: vromero, jlahoda
jjg [Mon, 16 Jun 2014 11:30:31 -0700] rev 25006
8046369: sjavac should not use javac internal API for starting javac
Reviewed-by: jfranck, alundblad, ohrstrom
alundblad [Thu, 12 Jun 2014 14:29:09 +0200] rev 25005
8042830: A recently added Xprefer test fails on Windows
Summary: Test now accepts both / and \ as file separator.
Reviewed-by: mcimadamore
ksrini [Thu, 22 May 2014 12:16:53 -0700] rev 25004
8042829: [javadoc] index-file output is not sorted correctly
8043062: JDK 9 platform and compiler upgrade failed on Solaris-sparcv9 with Javadoc.gmk:360: recipe for target docs/api/index.html
Reviewed-by: erikj, jjg
katleman [Thu, 19 Jun 2014 11:22:49 -0700] rev 25003
Added tag jdk9-b19 for changeset 26e23230009a
duke [Wed, 05 Jul 2017 19:46:31 +0200] rev 25002
Merge
katleman [Thu, 19 Jun 2014 11:22:36 -0700] rev 25001
Added tag jdk9-b19 for changeset 9ed534348756
duke [Wed, 05 Jul 2017 19:46:27 +0200] rev 25000
Merge
katleman [Thu, 19 Jun 2014 11:22:33 -0700] rev 24999
Added tag jdk9-b19 for changeset 12e7286572ef
duke [Wed, 05 Jul 2017 19:46:23 +0200] rev 24998
Merge
lana [Fri, 20 Jun 2014 10:14:50 -0700] rev 24997
Merge
lana [Wed, 18 Jun 2014 10:54:57 -0700] rev 24996
Merge
sundar [Tue, 17 Jun 2014 18:23:35 +0530] rev 24995
8047057: Add a regression test for the passing test cases from JDK-8042304
Reviewed-by: lagergren, attila
sundar [Tue, 17 Jun 2014 15:55:39 +0530] rev 24994
8047035: (function() "hello")() crashes in Lexer with jdk9
Reviewed-by: lagergren, hannesw, attila
lagergren [Tue, 17 Jun 2014 11:37:03 +0200] rev 24993
8046898: Make sure that lazy compilation is the default, remove redundant "enable lazy compilation" flags, added warning message if compile logging is enabled and lazy is switched off. Verified existing test suite code coverage equivalence between lazy and eager.
Reviewed-by: attila, hannesw
katleman [Thu, 19 Jun 2014 11:22:50 -0700] rev 24992
Added tag jdk9-b19 for changeset a7c5ef3bb9d4
duke [Wed, 05 Jul 2017 19:46:17 +0200] rev 24991
Merge
katleman [Thu, 19 Jun 2014 11:22:18 -0700] rev 24990
Added tag jdk9-b19 for changeset 7056eab40723
duke [Wed, 05 Jul 2017 19:46:13 +0200] rev 24989
Merge
lana [Fri, 20 Jun 2014 10:15:30 -0700] rev 24988
Merge
lana [Wed, 18 Jun 2014 10:55:17 -0700] rev 24987
Merge
scolebourne [Wed, 11 Jun 2014 08:25:33 +0100] rev 24986
8046416: Unable to parse an Instant from fields
Summary: Fix Instant parsing
Reviewed-by: rriggs
scolebourne [Thu, 12 Jun 2014 00:31:27 +0100] rev 24985
8046707: Performance of java.time could be better
Summary: Optimise performance
Reviewed-by: rriggs
vinnie [Wed, 18 Jun 2014 15:05:29 +0100] rev 24984
8047085: PKCS11/NSS tests failing intermittently on Windows
Reviewed-by: mullan
yan [Wed, 18 Jun 2014 17:34:05 +0400] rev 24983
8046596: fix doclint issues in swing classes, part 3 of 4
Reviewed-by: pchelko
Contributed-by: Andrei Eremeev <andrei.eremeev@oracle.com>
yan [Wed, 18 Jun 2014 17:31:01 +0400] rev 24982
8046595: fix doclint issues in swing classes, part 2 of 4
Reviewed-by: pchelko
Contributed-by: Andrei Eremeev <andrei.eremeev@oracle.com>
dsamersoff [Wed, 18 Jun 2014 03:29:58 -0700] rev 24981
8044762: com/sun/jdi/OptionTest.java test time out
Summary: gdata could be NULL in debugInit_exit
Reviewed-by: dcubed
sla [Wed, 18 Jun 2014 09:04:20 +0200] rev 24980
8046778: Better error messages when starting JMX agent via attach or jcmd
Reviewed-by: dholmes
chegar [Tue, 17 Jun 2014 10:47:07 +0100] rev 24979
8046902: Remove sun.misc.Timer
Reviewed-by: rriggs, mduigou, iris
sla [Mon, 09 Jun 2014 17:18:14 +0200] rev 24978
8046355: sun/tools/jstatd/TestJstatdExternalRegistry.java should be quarantined
Reviewed-by: sla
Contributed-by: alex.schenkman@oracle.com
sla [Mon, 09 Jun 2014 17:12:18 +0200] rev 24977
8046352: com/sun/tools/attach/TempDirTest.java should be quarantined
Reviewed-by: sla
Contributed-by: alex.schenkman@oracle.com
sla [Mon, 09 Jun 2014 17:04:11 +0200] rev 24976
8046351: com/sun/management/GarbageCollectorMXBean/GarbageCollectionNotification[Content]Test.java should be quarantined
Reviewed-by: sla
Contributed-by: alex.schenkman@oracle.com
sla [Fri, 13 Jun 2014 11:58:34 +0200] rev 24975
8046348: com/sun/jdi/OptionTest.java should be quarantined
Reviewed-by: sla
Contributed-by: alex.schenkman@oracle.com
vlivanov [Tue, 17 Jun 2014 13:06:05 +0400] rev 24974
8046903: VM anonymous class members can't be statically invocable
Reviewed-by: jrose
sla [Tue, 17 Jun 2014 10:01:16 +0200] rev 24973
6622468: TEST_BUG: Time to retire the @debuggeeVMOptions mechanism used in the com.sun.jdi infrastructure
Summary: Use jtreg "@run driver" for the JDI tests
Reviewed-by: sspitsyn, dholmes
smarks [Mon, 16 Jun 2014 17:52:21 -0700] rev 24972
8044730: small errors in ConcurrentHashMap and LongAdder docs
Reviewed-by: martin
mullan [Mon, 16 Jun 2014 13:48:58 -0400] rev 24971
Merge
mullan [Mon, 16 Jun 2014 13:47:42 -0400] rev 24970
8046044: Fix raw and unchecked lint warnings in XML Signature Impl
Reviewed-by: darcy
psandoz [Mon, 16 Jun 2014 17:45:26 +0100] rev 24969
8041679: Replace uses of StringBuffer with StringBuilder within core library classes
Reviewed-by: psandoz, alanb, xuelei, dfuchs, jfranck, prr, serb, chegar
Contributed-by: otaviopolianasantana@gmail.com
henryjen [Mon, 16 Jun 2014 08:09:30 -0700] rev 24968
8046389: Add missing @since tag under javax.sql.**
Reviewed-by: lancea
dsamersoff [Mon, 16 Jun 2014 07:25:11 -0700] rev 24967
8041498: Remove npt library
Summary: Get rid of npt library and move utf-related code to share/backend
Reviewed-by: sla
vinnie [Mon, 16 Jun 2014 13:40:49 +0100] rev 24966
8036613: [parfait] JNI exception pending in jdk/src/windows/native/sun/security/provider/WinCAPISeedGenerator.c
Reviewed-by: mullan
sla [Mon, 16 Jun 2014 13:52:25 +0200] rev 24965
8043939: Remove management-agent.jar
Reviewed-by: alanb
ykantser [Mon, 16 Jun 2014 11:03:54 +0200] rev 24964
6545295: TEST BUG: The test HatHeapDump1Test uses wrong path in exec call.
Reviewed-by: sla
michaelm [Fri, 13 Jun 2014 14:32:49 +0100] rev 24963
Merge
michaelm [Fri, 13 Jun 2014 14:30:41 +0100] rev 24962
8046588: test for SO_FLOW_SLA availability does not check for EACCESS
Reviewed-by: alanb, chegar
katleman [Thu, 19 Jun 2014 11:22:38 -0700] rev 24961
Added tag jdk9-b19 for changeset 40b2b32fa541
duke [Wed, 05 Jul 2017 19:46:03 +0200] rev 24960
Merge
lana [Fri, 20 Jun 2014 10:15:08 -0700] rev 24959
Merge
lana [Wed, 18 Jun 2014 10:56:06 -0700] rev 24958
Merge
amurillo [Fri, 13 Jun 2014 12:04:33 -0700] rev 24957
Merge
kvn [Fri, 13 Jun 2014 10:21:30 -0700] rev 24956
Merge
mduigou [Thu, 12 Jun 2014 16:31:07 -0700] rev 24955
8032045: Enable compiler and linker safety switches for debug builds
Summary: Enable GCC linker protections, runtime bounds checks and stack protection.
Reviewed-by: dholmes, kvn, coleenp
kvn [Thu, 12 Jun 2014 10:15:43 -0700] rev 24954
8046516: Segmentation fault in JVM (easily reproducible)
Summary: Place new nodes on the previous loop exit in reorg_offsets().
Reviewed-by: roland
kvn [Wed, 11 Jun 2014 11:05:10 -0700] rev 24953
8035968: Leverage CPU Instructions to Improve SHA Performance on SPARC
Summary: Add C2 SHA intrinsics on SPARC
Reviewed-by: kvn, roland
Contributed-by: james.cheng@oracle.com
thartmann [Wed, 11 Jun 2014 09:16:19 +0200] rev 24952
8044538: assert(which != imm_operand) failed: instruction is not a movq reg, imm64
Summary: Fixed internal_word_Relocation::target() to not retrieve target address from code if relocation points into the constant section. Added test.
Reviewed-by: kvn, twisti, dlong
iignatyev [Tue, 10 Jun 2014 20:53:23 +0000] rev 24951
Merge
iignatyev [Tue, 10 Jun 2014 23:18:25 +0400] rev 24950
8044575: testlibrary_tests/whitebox/vm_flags/UintxTest.java failed: assert(!res || TypeEntriesAtCall::arguments_profiling_enabled()) failed: no profiling of arguments
Reviewed-by: kvn, jmasa
kvn [Tue, 10 Jun 2014 12:57:50 -0700] rev 24949
Merge
kvn [Tue, 10 Jun 2014 12:28:06 -0700] rev 24948
8035605: Expand functionality of PredictedIntrinsicGenerator
Summary: Allow several predicates and separate intrinsic methods per one intrinsified (virtual) method.
Reviewed-by: roland
neliasso [Mon, 09 Jun 2014 10:32:49 +0200] rev 24947
8040244: compiler/whitebox/IsMethodCompilableTest.java fails
Summary: Prevent from running with Xcomp
Reviewed-by: kvn, twisti
roland [Tue, 10 Jun 2014 13:37:16 +0200] rev 24946
8026796: Make replace_in_map() on parent maps generic
Summary: propagate node replacements along control flow edges to callers
Reviewed-by: kvn, vlivanov
vlivanov [Tue, 10 Jun 2014 10:00:59 +0000] rev 24945
8033626: assert(ex_map->jvms()->same_calls_as(_exceptions->jvms())) failed: all collected exceptions must come from the same place
Reviewed-by: kvn, roland
thartmann [Tue, 10 Jun 2014 08:53:22 +0200] rev 24944
8033145: Runtime1::arraycopy_count_address uses wrong _oop_arraycopy_cnt variable
Summary: The method Runtime1::arraycopy_count_address(..) returns the address of Runtime::_oop_arraycopy_cnt instead of the the file static variable _oop_arraycopy_cnt.
Reviewed-by: roland, kvn, twisti
iignatyev [Wed, 11 Jun 2014 18:56:01 +0400] rev 24943
8044673: Create jtreg groups to list GC specific tests
Reviewed-by: dholmes, iignatyev
Contributed-by: dmitry.fazunenko@oracle.com
jmasa [Tue, 10 Jun 2014 20:46:28 -0700] rev 24942
Merge
jwilhelm [Fri, 02 May 2014 02:11:34 +0200] rev 24941
8042298: Remove the names gen0 and gen1 from the GC code
Summary: Renamed gen0 and gen1 to young and old throughout the GC code.
Reviewed-by: sjohanss, jcoomes
jwilhelm [Wed, 30 Apr 2014 02:41:00 +0200] rev 24940
8026396: Remove information duplication in the collector policy
Summary: Cleaned up the usage of flags in collector policy.
Reviewed-by: sjohanss, jcoomes
kvn [Mon, 09 Jun 2014 15:42:31 -0700] rev 24939
8046275: Fastdebug build failing on jdk9/hs/ control jobs after pulling some hs-comp changes
Summary: Add missing check for Opaque nodes from loop predicates in clone_loop().
Reviewed-by: iveresov
vlivanov [Mon, 09 Jun 2014 11:49:02 +0000] rev 24938
8046226: assert(_thread == Thread::current()) failed: thread must be current w/ -XX:+TraceDeoptimization -XX:+Verbose
Reviewed-by: twisti, dcubed, fparain
amurillo [Fri, 06 Jun 2014 13:31:55 -0700] rev 24937
Merge
kvn [Fri, 06 Jun 2014 11:37:23 -0700] rev 24936
Merge
thartmann [Thu, 05 Jun 2014 10:43:16 +0200] rev 24935
8031389: On x86 C1 emits two relocations for polls
Summary: C1 emits two poll_type relocations at safepoint polls because LIR_Assembler::safepoint_poll(..) adds a relocation and calls LIR_Assembler::add_debug_info_for_branch(..) which adds a relocation as well. The implementation of add_debug_info_for_branch(..) is changed to not emit a poll relocation.
Reviewed-by: kvn, roland
rbackman [Thu, 22 May 2014 13:42:44 +0200] rev 24934
8030976: Untaken paths should be more vigorously pruned at highest optimization level
Reviewed-by: roland, vlivanov
rbackman [Wed, 04 Jun 2014 10:01:28 +0200] rev 24933
8031994: java/lang/Character/CheckProp test times out
Reviewed-by: iveresov, roland
mikael [Tue, 03 Jun 2014 18:24:38 -0700] rev 24932
8044735: Print format/argument warnings
Reviewed-by: twisti, kvn
iignatyev [Wed, 04 Jun 2014 00:25:21 +0400] rev 24931
8044339: Update FilterSpuriousWakeups documentation. Review "Solaris only" vm options descriptions
Reviewed-by: kvn, dholmes, iignatyev
mikael [Mon, 02 Jun 2014 15:48:34 -0700] rev 24930
8044242: Remove dead NativeMovRegMemPatching class
Reviewed-by: twisti, kvn
twisti [Mon, 02 Jun 2014 13:53:52 -0700] rev 24929
Merge
twisti [Mon, 02 Jun 2014 10:48:02 -0700] rev 24928
Merge
drchase [Mon, 02 Jun 2014 15:49:53 -0400] rev 24927
Merge
drchase [Mon, 02 Jun 2014 14:32:29 -0400] rev 24926
8029381: assert(is_method_type()) failed: bad cast
Summary: Access to method_type and appendix from constant pool (cpcache) needs to be guarded by is_f1_null() because of racy update/initialization.
Reviewed-by: kvn, coleenp, jrose
iveresov [Mon, 02 Jun 2014 07:26:52 -1000] rev 24925
8044496: 8034812 broke build with clang
Summary: Remove superfluous clang-diagnostic-pop
Reviewed-by: kvn, drchase
roland [Mon, 02 Jun 2014 10:01:15 +0200] rev 24924
8043413: REGRESSION: Hotspot causes segmentation fault in jdk8ux, but not in jdk7ux
Summary: long series of lambda form calls trigger stack overflow in c2
Reviewed-by: kvn, vlivanov
thartmann [Mon, 02 Jun 2014 08:07:29 +0200] rev 24923
8034812: remove IDX_INIT macro hack in Node class
Summary: The IDX_INIT macro used by Node::Node(...) to retrieve the Compile object is removed and replaced by a call to Compile::current(). The Node constructor, new operator and all calls to it are adapted accordingly.
Reviewed-by: kvn, jrose, iveresov, goetz
iignatyev [Fri, 30 May 2014 20:01:11 +0000] rev 24922
Merge
iignatyev [Fri, 30 May 2014 17:20:48 +0400] rev 24921
8038756: new WB API :: get/setVMFlag
Reviewed-by: vlivanov, sla
anoll [Fri, 30 May 2014 19:21:42 +0000] rev 24920
Merge
thartmann [Fri, 30 May 2014 09:26:48 +0200] rev 24919
8021775: compiler/8009761/Test8009761.java "Failed: init recursive calls: 51. After deopt 50"
Summary: Reimplemented the test using the Whitebox API to deterministically trigger compilation and deoptimization. Now allowing number of recursive calls to vary by 1.
Reviewed-by: twisti, roland, iignatyev
twisti [Fri, 30 May 2014 09:49:50 -0700] rev 24918
Merge
mikael [Thu, 29 May 2014 16:01:13 -0700] rev 24917
8044071: Print format/argument warnings
Reviewed-by: drchase, dholmes, lfoltan, twisti
anoll [Fri, 30 May 2014 06:50:38 +0200] rev 24916
8011646: SEGV in compiled code with loop predication
Summary: Remove control edge of load node to ensure that castPP removal sets the control edge correctly
Reviewed-by: kvn, roland
katleman [Thu, 19 Jun 2014 11:22:25 -0700] rev 24915
Added tag jdk9-b19 for changeset 718694e51e25
lana [Fri, 20 Jun 2014 10:14:33 -0700] rev 24914
Merge
lana [Wed, 18 Jun 2014 10:54:13 -0700] rev 24913
Merge
amurillo [Fri, 13 Jun 2014 12:35:18 -0700] rev 24912
Merge
mduigou [Thu, 12 Jun 2014 16:33:32 -0700] rev 24911
8032045: Enable compiler and linker safety switches for debug builds
Summary: Enable GCC linker protections, runtime bounds checks and stack protection.
Reviewed-by: ihse, dholmes
katleman [Thu, 19 Jun 2014 11:22:16 -0700] rev 24910
Added tag jdk9-b19 for changeset db769f12fe54
duke [Wed, 05 Jul 2017 19:45:37 +0200] rev 24909
Added tag jdk9-b19 for changeset 2dcf544eb7ed
duke [Wed, 05 Jul 2017 19:45:37 +0200] rev 24908
Merge
duke [Wed, 05 Jul 2017 19:45:33 +0200] rev 24907
Merge
lana [Wed, 18 Jun 2014 10:09:04 -0700] rev 24906
Merge
lana [Thu, 12 Jun 2014 15:37:29 -0700] rev 24905
Merge
emc [Thu, 12 Jun 2014 11:32:23 -0400] rev 24904
8043484: DPrinter does not compile
Summary: Make DPrinter compile
Reviewed-by: jjg
pgovereau [Wed, 11 Jun 2014 12:49:10 -0400] rev 24903
8027886: javac allows illegal receiver parameters
8029042: Receiver parameter not supported on local class constructor
Reviewed-by: jfranck, jlahoda
dlsmith [Tue, 10 Jun 2014 15:25:01 -0600] rev 24902
8015101: Covariance of return type implied by upper bounding on type parameter is ignored
Summary: Capture intersection supertypes before comparing their members
Reviewed-by: vromero
dlsmith [Tue, 10 Jun 2014 12:41:39 -0600] rev 24901
8037385: constant pool errors with -target 1.7 and static default methods
Summary: Add error check for static interface methods invoked from -source 7
Reviewed-by: vromero, mcimadamore
emc [Mon, 09 Jun 2014 15:46:44 -0400] rev 24900
8046296: java/util/concurrent/BlockingQueue/PollMemoryLeak.java fails in nightly on all platform due to compiler issue
Summary: Alter logic to choose type of type annotation position for a variable declaration
Reviewed-by: jjg
mcimadamore [Mon, 09 Jun 2014 12:54:02 +0100] rev 24899
8043725: javac fails with StackOverflowException
Summary: loose type comparison test should be protected against infinite recursion with fbounds
Reviewed-by: vromero
jlahoda [Mon, 09 Jun 2014 10:17:16 +0200] rev 24898
8033414: javac Plugin to receive notification (before and) after the compilation.
Summary: Introducing TaskEvent.Kind.COMPILATION, sending this event before and after compilation.
Reviewed-by: jjg, jfranck
Contributed-by: joel.franck@oracle.com, jan.lahoda@oracle.com
jjg [Sun, 08 Jun 2014 15:02:34 -0700] rev 24897
7026941: 199: path options ignored when reusing filemanager across tasks
Reviewed-by: jlahoda, jfranck
aeremeev [Fri, 06 Jun 2014 16:08:46 -0400] rev 24896
8042451: Write tests for all possible kinds of type annotation
Summary: Add new tests for type annotations to improve case coverage
Reviewed-by: jjg, emc, abuckley
emc [Fri, 06 Jun 2014 16:00:59 -0400] rev 24895
8027262: Determine location for type annotations earlier in compiler pipeline
8027261: Single codepath for attaching annotations to symbols
8027258: Permit a single source annotation to generate multiple bytecode annotations
8027182: Incorrect annotation attributes for type annotations on constructor type parameters
8044010: TypeAnnotation attribute is not generated for repeatable annotation in type argument
8044009: TypeAnnotation attribute is not generated for repeatable annotation in nested types
8043974: TypeAnnotation attribute is not generated for repeatable annotation in lambda
8043669: Few of the ANNOT tests in JCK9 test suite fail with an AssertionError for exception_index
8042060: Type parameter annotations don't work with multiple type parameters
8037348: RuntimeInvisibleAnnotations should not be generated for type annotation on anonymous innerclass creation
Summary: Initial rearchitecting of type annotations frontend pipeline
Reviewed-by: jjg, jfranck, mcimadamore, jlahoda, wmdietl
katleman [Fri, 13 Jun 2014 11:21:39 -0700] rev 24894
Added tag jdk9-b18 for changeset d38c730b86c1
duke [Wed, 05 Jul 2017 19:45:26 +0200] rev 24893
Merge
katleman [Fri, 13 Jun 2014 11:21:28 -0700] rev 24892
Added tag jdk9-b18 for changeset ce20b74c4195
duke [Wed, 05 Jul 2017 19:45:23 +0200] rev 24891
Merge
lana [Wed, 18 Jun 2014 10:08:42 -0700] rev 24890
Merge
lana [Thu, 12 Jun 2014 15:39:03 -0700] rev 24889
Merge
joehw [Wed, 11 Jun 2014 22:26:30 -0700] rev 24888
8041523: Xerces Update: Serializer improvements from Xalan
Reviewed-by: joehw
Contributed-by: david.x.li@oracle.com
joehw [Wed, 11 Jun 2014 09:26:03 -0700] rev 24887
8046443: A few typos in JAXP JavaDoc
Reviewed-by: dfuchs, chegar
katleman [Fri, 13 Jun 2014 11:21:26 -0700] rev 24886
Added tag jdk9-b18 for changeset 3a82fb0d8a15
duke [Wed, 05 Jul 2017 19:45:17 +0200] rev 24885
Merge
lana [Wed, 18 Jun 2014 10:08:47 -0700] rev 24884
Merge
lana [Thu, 12 Jun 2014 15:37:37 -0700] rev 24883
Merge
sundar [Thu, 12 Jun 2014 17:39:09 +0530] rev 24882
8044517: Run & debug single Nashorn test
Reviewed-by: lagergren, attila
Contributed-by: jaroslav.tulach@oracle.com
sundar [Wed, 11 Jun 2014 08:53:35 +0530] rev 24881
8044798: API for debugging Nashorn
Reviewed-by: jlaskey, hannesw
attila [Mon, 09 Jun 2014 16:00:06 +0200] rev 24880
8046025: AccessorProperty.getGetter is not threadsafe
Reviewed-by: jlaskey, lagergren
hannesw [Fri, 06 Jun 2014 16:51:53 +0200] rev 24879
8046215: Running uncompilable scripts throws NullPointerException
Reviewed-by: sundar, jlaskey
katleman [Fri, 13 Jun 2014 11:21:41 -0700] rev 24878
Added tag jdk9-b18 for changeset 6ff236765d3b
duke [Wed, 05 Jul 2017 19:45:12 +0200] rev 24877
Merge
katleman [Fri, 13 Jun 2014 11:21:15 -0700] rev 24876
Added tag jdk9-b18 for changeset ab3f668fd6e3
duke [Wed, 05 Jul 2017 19:45:08 +0200] rev 24875
Merge
lana [Wed, 18 Jun 2014 10:09:22 -0700] rev 24874
Merge
weijun [Fri, 13 Jun 2014 08:25:50 +0800] rev 24873
8046702: default_options.sh test failure on Solaris
Reviewed-by: xuelei
lana [Thu, 12 Jun 2014 15:38:24 -0700] rev 24872
Merge
sjiang [Thu, 12 Jun 2014 10:32:19 +0200] rev 24871
8044865: Fix raw and unchecked lint warnings in management-related code
Reviewed-by: darcy, sla, egahlin, dfuchs
sla [Wed, 11 Jun 2014 15:47:53 +0200] rev 24870
8044135: Add API to start JMX agent from attach framework
Reviewed-by: alanb
prappo [Tue, 10 Jun 2014 11:15:23 +0100] rev 24869
8027308: HttpURLConnection should better handle URLs with literal IPv6 addresses
Reviewed-by: chegar, alanb, michaelm
weijun [Wed, 11 Jun 2014 18:27:10 +0800] rev 24868
8023197: Pre-configured command line options for keytool and jarsigner
Reviewed-by: xuelei
jfranck [Tue, 10 Jun 2014 14:40:20 +0200] rev 24867
8029674: (reflect) getMethods returns default methods that are not members of the class
Summary: Filter out methods that have a more specific default method from result
Reviewed-by: darcy, dlsmith
weijun [Wed, 11 Jun 2014 16:33:23 +0800] rev 24866
8046499: nativecache.c prints to stdout in debug build
Reviewed-by: xuelei
henryjen [Tue, 10 Jun 2014 16:18:54 -0700] rev 24865
8044740: Convert all JDK versions used in @since tag to 1.n[.n] in jdk repo
Reviewed-by: mduigou, lancea, alanb, mullan
ascarpino [Tue, 10 Jun 2014 14:17:32 -0700] rev 24864
8046368: Code cleanup in SeedGenerator.java
Reviewed-by: mullan
Contributed-by: Jamil Nimeh <jamil.j.nimeh@oracle.com>
ascarpino [Tue, 10 Jun 2014 12:04:42 -0700] rev 24863
8039212: SecretKeyBasic.sh needs to avoid NSS libnss3 and libsoftokn3 version mismatches
Reviewed-by: vinnie
martin [Tue, 10 Jun 2014 08:07:39 -0700] rev 24862
8004807: java/util/Timer/Args.java failing intermittently in HS testing
Summary: update test to improve reliability
Reviewed-by: rriggs, ewang
vinnie [Tue, 10 Jun 2014 15:49:53 +0100] rev 24861
8040812: Uninitialised memory in jdk/src/share/native/sun/security/ec/impl/mpi.c
Reviewed-by: mullan
vlivanov [Mon, 09 Jun 2014 15:40:40 +0400] rev 24860
8032400: JSR292: invokeSpecial: InternalError attempting to lookup a method
Reviewed-by: psandoz, jrose
mduigou [Fri, 06 Jun 2014 14:23:08 -0700] rev 24859
8046085: inserting null key into HashMap treebin fails.
Reviewed-by: dl, mduigou, alanb, chegar
Contributed-by: paul.sandoz@oracle.com, mike.duigou@oracle.com
luchsh [Sat, 07 Jun 2014 00:17:02 +0800] rev 24858
8043954: Add async connect() support to NET_Connect() for AIX platform
Reviewed-by: alanb
weijun [Fri, 06 Jun 2014 22:31:53 +0800] rev 24857
8044747: [TESTBUG] Test sun/security/tools/policytool/i18n.sh fails after clicking 'Done' button in test frame
Reviewed-by: xuelei
chegar [Fri, 06 Jun 2014 10:47:30 +0100] rev 24856
8043613: Update .properties files for serialver tool
Reviewed-by: mfang
katleman [Fri, 13 Jun 2014 11:21:30 -0700] rev 24855
Added tag jdk9-b18 for changeset fa91157087a5
duke [Wed, 05 Jul 2017 19:45:00 +0200] rev 24854
Merge
lana [Wed, 18 Jun 2014 10:08:52 -0700] rev 24853
Merge
lana [Thu, 12 Jun 2014 19:03:25 -0700] rev 24852
Merge
lana [Thu, 12 Jun 2014 15:36:49 -0700] rev 24851
Merge
amurillo [Fri, 06 Jun 2014 10:19:50 -0700] rev 24850
Merge
jmasa [Thu, 05 Jun 2014 10:34:57 -0700] rev 24849
Merge
pliden [Wed, 04 Jun 2014 14:16:20 +0200] rev 24848
8044768: Backout fix for JDK-8040807
Reviewed-by: brutisso, ehelin
ehelin [Thu, 29 May 2014 14:31:28 +0200] rev 24847
8042933: assert(capacity_until_gc >= committed_bytes) failed
Reviewed-by: stefank, jmasa
brutisso [Tue, 03 Jun 2014 09:34:04 +0000] rev 24846
Merge
brutisso [Tue, 03 Jun 2014 10:44:36 +0200] rev 24845
8043239: G1: Missing post barrier in processing of j.l.ref.Reference objects
Summary: Removed all write barriers during reference processing and added explicit write barriers when iterating through the discovered list.
Reviewed-by: pliden, jmasa, tschatzl
pliden [Tue, 03 Jun 2014 10:37:46 +0200] rev 24844
8040807: G1: Enable G1CollectedHeap::stop()
Reviewed-by: brutisso, jmasa, tschatzl
jmasa [Mon, 02 Jun 2014 06:29:34 -0700] rev 24843
Merge
pliden [Fri, 30 May 2014 10:43:51 +0200] rev 24842
8042310: TestStringDeduplicationMemoryUsage test failing
Reviewed-by: ehelin, jwilhelm
pliden [Fri, 30 May 2014 10:37:39 +0200] rev 24841
8044132: Quarantine unstable/broken GC tests
Reviewed-by: ehelin, jwilhelm
mseledtsov [Mon, 02 Jun 2014 21:36:59 -0400] rev 24840
8038587: [TESTBUG] Create CDS tests to exercise region sizes and base address
Summary: Added new tests to cover missing CDS basic funtions
Reviewed-by: coleenp, ctornqvi
mgronlun [Tue, 03 Jun 2014 09:44:54 +0200] rev 24839
8044531: Event based tracing locks to rank as leafs where possible
Reviewed-by: dcubed, dholmes
ctornqvi [Mon, 02 Jun 2014 18:15:18 +0000] rev 24838
Merge
ctornqvi [Mon, 02 Jun 2014 19:08:18 +0200] rev 24837
8044364: runtime/RedefineFinalizer test fails on windows
Summary: Rewrote the test in pure Java, added RedefineClassHelper utility class
Reviewed-by: coleenp, allwin, gtriantafill, dsamersoff
rdurbin [Mon, 02 Jun 2014 09:30:08 -0700] rev 24836
8038132: jprt bundles have libjsig.dylib in different place on OSX
Summary: The build of Hotspot should not remove the symlinks for libjsig.
Reviewed-by: dcubed, dholmes
ykantser [Mon, 02 Jun 2014 11:20:14 +0200] rev 24835
8043915: Tests get ClassNotFoundException: com.oracle.java.testlibrary.StreamPumper
Reviewed-by: sla, allwin
coleenp [Sun, 01 Jun 2014 11:56:15 -0400] rev 24834
Merge
sla [Fri, 30 May 2014 19:13:07 +0200] rev 24833
8044398: Attach code should propagate errors in Diagnostic Commands as errors
Reviewed-by: dcubed, mgronlun
dcubed [Fri, 30 May 2014 07:20:51 -0700] rev 24832
8036823: Stack trace sometimes shows 'locked' instead of 'waiting to lock'
Summary: Add a !owner check for 'waiting to lock' to catch current_pending_monitor corner cases.
Reviewed-by: dholmes, sspitsyn, kmo, zgu
Contributed-by: rednaxelafx@gmail.com, zhengyu.gu@oracle.com, daniel.daugherty@oracle.com
lfoltan [Thu, 29 May 2014 08:58:51 -0400] rev 24831
8041623: Solaris Studio 12.4 C++ 5.13, CHECK_UNHANDLED_OOPS use of class oop's copy constructor definitions causing error level diagnostic.
Summary: Fix several minor compilation issues with volatile oops for CHECK_UNHANDLED_OOPS support.
Reviewed-by: coleenp, hseigel
ctornqvi [Wed, 28 May 2014 22:59:29 +0200] rev 24830
8043786: [TESTBUG] runtime/CommandLine/TestHexArguments.java test fails in nightly
Summary: Changed test to not pass on external flags to child processes
Reviewed-by: coleenp, hseigel
dsamersoff [Wed, 28 May 2014 15:03:36 +0000] rev 24829
Merge
dsamersoff [Wed, 28 May 2014 07:36:32 -0700] rev 24828
6904403: assert(f == k->has_finalizer(),"inconsistent has_finalizer") with debug VM
Summary: Don't assert if one of classes in hierarhy was redefined
Reviewed-by: coleenp, sspitsyn
poonam [Wed, 28 May 2014 06:26:05 -0700] rev 24827
8043086: Hotspot is expected to report OOM which is occurred String.intern(), but crashes in JDK8u5
Summary: In case of allocation failure, restore the value of _chunk in Arena
Reviewed-by: dholmes, dcubed
minqi [Tue, 27 May 2014 21:58:23 -0700] rev 24826
8043896: Error reporting for insufficient shared region size is incorrect
Summary: In SharedSpaceType, we have three enum types which are used in report_out_of_shared_space(SharedSpaceType type). In fact we supplied more than three messages and flags. This leads the warning always gives wrong message with the first not used.
Reviewed-by: iklam, coleenp
Contributed-by: yumin.qi@oracle.com
katleman [Fri, 13 Jun 2014 11:21:19 -0700] rev 24825
Added tag jdk9-b18 for changeset f41278d32da8
katleman [Fri, 13 Jun 2014 11:21:13 -0700] rev 24824
Added tag jdk9-b18 for changeset 09ca10d317fc
duke [Wed, 05 Jul 2017 19:44:42 +0200] rev 24823
Added tag jdk9-b18 for changeset c5495e25c725
duke [Wed, 05 Jul 2017 19:44:42 +0200] rev 24822
Merge
duke [Wed, 05 Jul 2017 19:44:39 +0200] rev 24821
Merge
katleman [Thu, 12 Jun 2014 10:32:42 -0700] rev 24820
Added tag jdk9-b17 for changeset abd9a49d0b9c
duke [Wed, 05 Jul 2017 19:44:35 +0200] rev 24819
Merge
katleman [Thu, 12 Jun 2014 10:32:30 -0700] rev 24818
Added tag jdk9-b17 for changeset f67a670502cb
duke [Wed, 05 Jul 2017 19:44:33 +0200] rev 24817
Merge
katleman [Thu, 12 Jun 2014 10:32:27 -0700] rev 24816
Added tag jdk9-b17 for changeset a190ad71abdc
duke [Wed, 05 Jul 2017 19:44:29 +0200] rev 24815
Merge
katleman [Thu, 12 Jun 2014 10:32:44 -0700] rev 24814
Added tag jdk9-b17 for changeset 681b70d49d8d
duke [Wed, 05 Jul 2017 19:44:26 +0200] rev 24813
Merge
katleman [Thu, 12 Jun 2014 10:32:11 -0700] rev 24812
Added tag jdk9-b17 for changeset 51596e763410
duke [Wed, 05 Jul 2017 19:44:23 +0200] rev 24811
Merge
katleman [Thu, 12 Jun 2014 10:32:32 -0700] rev 24810
Added tag jdk9-b17 for changeset e2e5f24869d5
duke [Wed, 05 Jul 2017 19:44:20 +0200] rev 24809
Merge
tbell [Thu, 12 Jun 2014 18:42:33 +0000] rev 24808
Merge
tbell [Thu, 12 Jun 2014 18:09:29 +0000] rev 24807
8046474: Source changes needed to build JDK 9 with new platforms and compilers on Solaris and Linux
Reviewed-by: erikj, dholmes
katleman [Thu, 12 Jun 2014 10:32:21 -0700] rev 24806
Added tag jdk9-b17 for changeset b14260e7f98f
tbell [Thu, 12 Jun 2014 18:42:29 +0000] rev 24805
Merge
tbell [Thu, 12 Jun 2014 18:08:39 +0000] rev 24804
8046474: Source changes needed to build JDK 9 with new platforms and compilers on Solaris and Linux
Reviewed-by: erikj, dholmes
katleman [Thu, 12 Jun 2014 10:32:09 -0700] rev 24803
Added tag jdk9-b17 for changeset 4f048ac42b56
duke [Wed, 05 Jul 2017 19:44:08 +0200] rev 24802
Added tag jdk9-b17 for changeset 410bccbded9e
duke [Wed, 05 Jul 2017 19:44:08 +0200] rev 24801
Merge
duke [Wed, 05 Jul 2017 19:44:04 +0200] rev 24800
Merge
lana [Thu, 05 Jun 2014 19:38:17 -0700] rev 24799
Merge
jjg [Thu, 05 Jun 2014 13:22:37 -0700] rev 24798
8046067: test/tools/javac/api/6410643/T6410643.java is broken
Reviewed-by: darcy, ksrini
sogoel [Thu, 05 Jun 2014 10:57:10 -0700] rev 24797
8044072: Group 2: create .out files for OverrideChecks tests in tools/javac dir
Reviewed-by: jjg
sogoel [Thu, 05 Jun 2014 10:44:38 -0700] rev 24796
8044064: Group 1: create .out files for cast and capture negative tests in tools/javac dir
Reviewed-by: jjg
mcimadamore [Thu, 05 Jun 2014 12:21:38 +0100] rev 24795
8043893: Inference doesn't report error on incompatible upper bounds
Summary: Failure on type-equality check during incorporation doesn't trigger inference error
Reviewed-by: vromero
vromero [Wed, 04 Jun 2014 20:01:13 +0100] rev 24794
8041713: Type inference of non-existent method references crashes the compiler
Reviewed-by: mcimadamore
vromero [Mon, 02 Jun 2014 22:36:40 +0100] rev 24793
8044487: Fix for 8042785 causes regression tests to fail with java.lang.VerifyError
Reviewed-by: jjg, ksrini
vromero [Fri, 30 May 2014 18:21:05 +0100] rev 24792
8042785: javac, bridge methods are not getting the flags from the original method
Reviewed-by: jjg, jlahoda
katleman [Wed, 04 Jun 2014 20:20:42 -0700] rev 24791
Added tag jdk9-b16 for changeset f75464f610f6
duke [Wed, 05 Jul 2017 19:43:59 +0200] rev 24790
Merge
katleman [Wed, 04 Jun 2014 20:20:26 -0700] rev 24789
Added tag jdk9-b16 for changeset 1fe6db2229a0
duke [Wed, 05 Jul 2017 19:43:55 +0200] rev 24788
Merge
katleman [Wed, 04 Jun 2014 20:20:16 -0700] rev 24787
Added tag jdk9-b16 for changeset 799f78314361
duke [Wed, 05 Jul 2017 19:43:51 +0200] rev 24786
Merge
lana [Thu, 05 Jun 2014 19:38:45 -0700] rev 24785
Merge
attila [Thu, 05 Jun 2014 12:16:09 +0200] rev 24784
8044816: On-demand compiled top-level program doesn't need :createProgramFunction
Reviewed-by: jlaskey, lagergren, sundar
attila [Thu, 05 Jun 2014 12:15:45 +0200] rev 24783
8046014: MultiGlobalCompiledScript should cache :createProgramFunction handle
Reviewed-by: lagergren, sundar
attila [Wed, 04 Jun 2014 20:43:37 +0200] rev 24782
8038413: NPE in unboxInteger
Reviewed-by: jlaskey, sundar
attila [Wed, 04 Jun 2014 16:52:50 +0200] rev 24781
8044803: Unnecessary restOf check
Reviewed-by: hannesw, jlaskey
sundar [Wed, 04 Jun 2014 19:01:24 +0530] rev 24780
8044695: __stack__ becomes visible in Error properties
Reviewed-by: lagergren, jlaskey, attila
attila [Wed, 04 Jun 2014 14:32:23 +0200] rev 24779
8044502: Get rid of global optimistic flag
Reviewed-by: lagergren, sundar
attila [Wed, 04 Jun 2014 13:08:57 +0200] rev 24778
8044638: Tidy up Nashorn codebase for code standards
Reviewed-by: lagergren, sundar
sundar [Wed, 04 Jun 2014 13:55:21 +0530] rev 24777
8044750: megamorphic getter for scope objects does not call __noSuchProperty__ hook
Reviewed-by: attila, lagergren, hannesw
attila [Tue, 03 Jun 2014 12:05:59 +0200] rev 24776
8044518: Ensure exceptions related to optimistic recompilation are not serializable
Reviewed-by: lagergren, sundar
attila [Tue, 03 Jun 2014 12:05:42 +0200] rev 24775
8044534: Constant folding for unary + should produce int for boolean literals
Reviewed-by: lagergren, sundar
attila [Tue, 03 Jun 2014 12:04:36 +0200] rev 24774
8044533: Deoptimizing negation produces wrong result for zero
Reviewed-by: lagergren, sundar
attila [Tue, 03 Jun 2014 11:31:06 +0200] rev 24773
8044171: Make optimistic exception handlers smaller
Reviewed-by: hannesw, lagergren
sundar [Tue, 03 Jun 2014 14:13:03 +0530] rev 24772
8044520: Nashorn cannot execute node.js's express module
Reviewed-by: hannesw, lagergren
sundar [Tue, 03 Jun 2014 13:57:52 +0530] rev 24771
8044612: StringIndexOutOfBoundException in NativeRegExp.appendReplacement
Reviewed-by: hannesw, lagergren
attila [Mon, 02 Jun 2014 17:36:43 +0200] rev 24770
Merge
attila [Wed, 28 May 2014 16:53:43 +0200] rev 24769
Merge