2016-07-08 |
dcubed |
Merge
|
file |
diff |
annotate
|
2016-07-07 |
mli |
8157667: sun/security/x509/URICertStore/ExtensionsWithLDAP.java has to be updated due to JDK-8134577
|
file |
diff |
annotate
|
2016-07-06 |
mli |
8160866: IntPrimitiveOpsTests.java still in ProblemList.txt while related bug has been closed
|
file |
diff |
annotate
|
2016-07-05 |
amurillo |
Merge
|
file |
diff |
annotate
|
2016-06-30 |
amurillo |
8160690: Quarantine VarHandles tests
|
file |
diff |
annotate
|
2016-07-01 |
amurillo |
Merge
|
file |
diff |
annotate
|
2016-07-04 |
igerasim |
8153948: sun/security/mscapi/ShortRSAKey1024.sh fails with "Field length overflow"
|
file |
diff |
annotate
|
2016-06-28 |
darcy |
8160502: Problem listing of several http2 tests
|
file |
diff |
annotate
|
2016-06-24 |
rriggs |
8160278: Remove java/time/test/java/time/TestClock_System from the problem list
|
file |
diff |
annotate
|
2016-07-07 |
dcubed |
8161010: quarantine sun/tools/jps/TestJpsJar.java in JDK9-dev and JDK9-hs
|
file |
diff |
annotate
|
2016-06-24 |
amurillo |
Merge
|
file |
diff |
annotate
|
2016-06-22 |
akulyakh |
8159959: Quarantine java/lang/management/MemoryMXBean/Pending.java
|
file |
diff |
annotate
|
2016-06-22 |
asmotrak |
8074580: sun/security/pkcs11/rsa/TestKeyPairGenerator.java fails due to PKCS11Exception: CKR_FUNCTION_FAILED
|
file |
diff |
annotate
|
2016-06-22 |
naoto |
8159781: jlink --include-locales fails with java.util.regex.PatternSyntaxException
|
file |
diff |
annotate
|
2016-06-17 |
okutsu |
8158272: IncludeLocalesPluginTest.java fails with timeout
|
file |
diff |
annotate
|
2016-06-17 |
weijun |
8157387: StrongSecureRandom.java timeout after push for JDK-8141039
|
file |
diff |
annotate
|
2016-06-16 |
jlaskey |
8159206: All jlink or jmod tests failing
|
file |
diff |
annotate
|
2016-06-15 |
ddehaven |
Merge
|
file |
diff |
annotate
|
2016-06-13 |
chegar |
8041924: sun/net/www/http/ChunkedOutputStream/checkError.java fails on some systems
|
file |
diff |
annotate
|
2016-06-13 |
bgopularam |
8062758: Update java/security/Security/ClassLoaderDeadlock/Deadlock2.sh with the removal of -Djava.ext.dirs
|
file |
diff |
annotate
|
2016-06-12 |
mli |
8157665: ProblemList.txt needs to be updated as 7041639 closed
|
file |
diff |
annotate
|
2016-06-10 |
darcy |
8159263: Problem list tools/jmod/JmodTest.java
|
file |
diff |
annotate
|
2016-06-10 |
jlaskey |
8159228: Exclude jlink tests until jrt-fs patterns are rectified
|
file |
diff |
annotate
|
2016-06-08 |
amlu |
8159012: Problem list sun/net/www/http/ChunkedOutputStream/checkError.java
|
file |
diff |
annotate
|
2016-06-06 |
darcy |
8158870: Temporarily problem list DGCDeadLock.java on Mac
|
file |
diff |
annotate
|
2016-06-06 |
ddehaven |
Merge
|
file |
diff |
annotate
|
2016-06-01 |
ddehaven |
Merge
|
file |
diff |
annotate
|
2016-05-27 |
prr |
8157339: Further stabilization for the SwingSet client sanity tests
|
file |
diff |
annotate
|
2016-05-25 |
ddehaven |
Merge
|
file |
diff |
annotate
|
2016-05-20 |
serb |
8156579: Two JavaBeans tests failed
|
file |
diff |
annotate
|
2016-05-19 |
serb |
8148915: Intermittent failures of bug6400879.java
|
file |
diff |
annotate
|
2016-06-01 |
darcy |
8158451: Problem list IncludeLocalesPluginTest.java
|
file |
diff |
annotate
|
2016-05-31 |
rriggs |
8158254: Put java/time/test/java/time/TestClock_System on the problem list for Solaris
|
file |
diff |
annotate
|
2016-05-26 |
amlu |
8157663: Remove tools/jimage/JImageTest.java from ProblemList.txt
|
file |
diff |
annotate
|
2016-05-25 |
amlu |
8157813: Remove sun/rmi/transport/proxy/EagerHttpFallback.java from ProblemList.txt
|
file |
diff |
annotate
|
2016-05-25 |
jjiang |
8137255: sun/security/provider/NSASuiteB/TestDSAGenParameterSpec.java timeouts intermittently
|
file |
diff |
annotate
|
2016-05-20 |
asmotrak |
8157344: Multiple test timeouts after push for JDK-8141039
|
file |
diff |
annotate
|
2016-05-19 |
bchristi |
8029891: Deadlock detected in java/lang/ClassLoader/deadlock/GetResource.java
|
file |
diff |
annotate
|
2016-05-18 |
ksrini |
8156807: Pack200 must support v53.0 class files
|
file |
diff |
annotate
|
2016-05-18 |
serb |
8156581: Cleanup of ProblemList.txt
|
file |
diff |
annotate
|
2016-05-18 |
mli |
8157011: Problem list tools/pack200/TestNormal.java and java/io/pathNames/GeneralWin32.java
|
file |
diff |
annotate
|
2016-05-16 |
xuelei |
8156991: Problem list UnsupportedDHKeys.java on windows
|
file |
diff |
annotate
|
2016-05-12 |
darcy |
8156897: Problem list ShortRSAKey1024.sh on windows
|
file |
diff |
annotate
|
2016-05-12 |
darcy |
8156890: Temporarily problem list ListKeychainStore.sh on Mac
|
file |
diff |
annotate
|
2016-05-11 |
jlaskey |
8156781: change to jlink has result in test failure
|
file |
diff |
annotate
|
2016-05-11 |
jlaskey |
8156766: jdk/test/tools/jlink/plugins/SorterPluginTest.java broken
|
file |
diff |
annotate
|
2016-05-09 |
amlu |
8156529: Problem list java/nio/file/WatchService/DeleteInterference.java
|
file |
diff |
annotate
|
2016-05-02 |
asmotrak |
8155859: Problem list tools/pack200/Pack200Props.java
|
file |
diff |
annotate
|
2016-04-27 |
rriggs |
8155182: fix to JDK-8066750 broke jdk9 builds
|
file |
diff |
annotate
|
2016-04-26 |
rriggs |
8066750: Remove HTTP proxy implementation and tests from RMI
|
file |
diff |
annotate
|
2016-04-15 |
amurillo |
Merge
|
file |
diff |
annotate
|
2016-04-14 |
amjiang |
8153545: sun/security/pkcs11/Provider/Login.sh fails on Linux
|
file |
diff |
annotate
|
2016-04-14 |
dcubed |
Merge
|
file |
diff |
annotate
|
2016-04-11 |
amurillo |
Merge
|
file |
diff |
annotate
|
2016-04-11 |
msheppar |
8134577: Eliminate or standardize a replacement for sun.net.spi.nameservice.NameServiceDescriptor
|
file |
diff |
annotate
|
2016-04-08 |
serb |
8153725: Problem list javax/sound/sampled/DirectAudio/bug6400879.java for Linux
|
file |
diff |
annotate
|
2016-04-07 |
amlu |
8153695: Problem list sun/security/pkcs11/Provider/Login.sh for linux-all
|
file |
diff |
annotate
|
2016-04-07 |
jjiang |
8153239: ProblemList update for sun/security/provider/NSASuiteB/TestDSAGenParameterSpec.java
|
file |
diff |
annotate
|
2016-04-06 |
ksrini |
8152622: tools/pack200/Pack200Props.java timed out
|
file |
diff |
annotate
|
2016-04-12 |
sspitsyn |
8153902: remove com/sun/jdi/InterfaceMethodsTest.java, com/sun/jdi/InvokeTest.java from ProblemList
|
file |
diff |
annotate
|
2016-04-07 |
dcubed |
Merge
|
file |
diff |
annotate
|
2016-03-31 |
darcy |
8151763: Use more informative format for problem list
|
file |
diff |
annotate
|
2016-03-29 |
mchung |
8153027: Exclude tools/jimage/JImageTest.java
|
file |
diff |
annotate
|
2016-03-25 |
amlu |
8152749: Mark AdaptorCloseAndInterrupt.java as intermittently failing
|
file |
diff |
annotate
|
2016-04-02 |
jwilhelm |
Merge
|
file |
diff |
annotate
|
2016-03-24 |
mchung |
8152715: Problem list tools/pack200/Pack200Props.java
|
file |
diff |
annotate
|
2016-03-24 |
akulyakh |
8147987: Remove sun/management/jmxremote/bootstrap/JMXInterfaceBindingTest.java from problemList
|
file |
diff |
annotate
|
2016-03-24 |
coleenp |
8152719: ignore this com/sun/jdi/InterfaceMehtodsTest.java until bug is fix
|
file |
diff |
annotate
|
2016-03-17 |
alanb |
8142968: Module System implementation
|
file |
diff |
annotate
|
2016-03-03 |
thartmann |
8151024: Remove TCKJapaneseChronology.java from the problem list
|
file |
diff |
annotate
|
2016-02-26 |
amlu |
8150608: Mark BashStreams.java as intermittently failing and put to ProblemList
|
file |
diff |
annotate
|
2015-12-28 |
jbachorik |
8145919: sun/management/jmxremote/bootstrap/RmiSslBootstrapTest failed with Connection failed for no credentials
|
file |
diff |
annotate
|
2016-02-18 |
amlu |
8149922: Remove intermittent key from security tests
|
file |
diff |
annotate
|
2016-02-12 |
darcy |
8149616: Problem list RmiSslBootstrapTest.sh
|
file |
diff |
annotate
|
2016-02-09 |
darcy |
8149492: Problem list CheckEncodings.sh
|
file |
diff |
annotate
|
2016-02-02 |
bpb |
8148891: Multiple failing javax/imageio/plugins after client integration
|
file |
diff |
annotate
|
2016-02-02 |
amlu |
8148710: Remove FlatMapOpTest.java from ProblemList.txt
|
file |
diff |
annotate
|
2016-01-21 |
amurillo |
8147985: Exclude sun/management/jmxremote/bootstrap/JMXInterfaceBindingTest.java on jdk9/dev
|
file |
diff |
annotate
|
2016-01-11 |
darcy |
8146745: Problem list SessionCacheSizeTests.java
|
file |
diff |
annotate
|
2016-01-10 |
darcy |
8146744: Remove LFMultiThreadCachingTest.java from windows problem list
|
file |
diff |
annotate
|
2016-01-09 |
darcy |
8146724: Problem list jdk/internal/jimage/JImageReadTest.java
|
file |
diff |
annotate
|
2015-12-22 |
prr |
Merge
|
file |
diff |
annotate
|
2015-12-11 |
bpb |
8144245: [PIT] javax/imageio/plugins/shared/WriteAfterAbort.java
|
file |
diff |
annotate
|
2015-12-18 |
chegar |
8145589: Test6277246.java fails to compile after JDK-8144479
|
file |
diff |
annotate
|
2015-12-16 |
darcy |
8145605: Problem list Test6277246.java until a fix for JDK-8145589
|
file |
diff |
annotate
|
2015-12-09 |
robm |
8141370: com/sun/jndi/ldap/LdapTimeoutTest.java failed intermittently
|
file |
diff |
annotate
|
2015-12-03 |
darcy |
8144627: Problem list WriteAfterAbort.java
|
file |
diff |
annotate
|
2015-11-25 |
amjiang |
8143377: Test PKCS8Test.java fails
|
file |
diff |
annotate
|
2015-11-23 |
darcy |
8143813: Problem list PKCS8Test.java
|
file |
diff |
annotate
|
2015-11-17 |
weijun |
8143138: Move sun/security/pkcs11/Secmod/LoadKeystore.java to problem list
|
file |
diff |
annotate
|
2015-11-13 |
darcy |
8142363: Remove LFMultiThreadCachingTest.java from windows problem list
|
file |
diff |
annotate
|
2015-11-05 |
jwilhelm |
Merge
|
file |
diff |
annotate
|
2015-10-29 |
jwilhelm |
Merge
|
file |
diff |
annotate
|
2015-10-28 |
ctornqvi |
8140647: [TESTBUG] Add failing JDK jtreg tests to ProblemList
|
file |
diff |
annotate
|
2015-10-29 |
ascarpino |
8139859: TestRSA.java: 'message larger than modulus' using SunRsaSign KeyFactory
|
file |
diff |
annotate
|
2015-10-20 |
amurillo |
Merge
|
file |
diff |
annotate
|
2015-10-01 |
dsamersoff |
8133063: Remove BasicLauncherTest from the problem list
|
file |
diff |
annotate
|
2015-10-20 |
ascarpino |
8139860: Add ucrypto/TestRSA.java to ProblemList: Message is larger than modulus
|
file |
diff |
annotate
|
2015-10-19 |
darcy |
8139925: Problem list LFMultiThreadCachingTest.java on windows
|
file |
diff |
annotate
|
2015-09-11 |
rriggs |
8133552: java/lang/ProcessHandle/InfoTest.java fails intermittently - incorrect user
|
file |
diff |
annotate
|
2015-09-09 |
dholmes |
8133611: Remove java/util/concurrent/locks/ReentrantLock/TimeoutLockLoops.java from problem list
|
file |
diff |
annotate
|
2015-09-04 |
jbachorik |
8134420: sun/tools/jps/TestJpsClass fails with java.lang.RuntimeException: The line 'line 2' does not match pattern '^\\d+\\s+.*': expected true, was false
|
file |
diff |
annotate
|
2015-09-02 |
darcy |
8134982: Problem list TCKJapaneseChronology.java
|
file |
diff |
annotate
|
2015-09-02 |
ptbrunet |
8134682: Remove com.sun.java.accessibility from jdk/src/closed/java.base/share/conf/security/restricted.pkgs
|
file |
diff |
annotate
|
2015-08-28 |
sla |
8134686: Exclude sun/tools/jps/ tests
|
file |
diff |
annotate
|
2015-08-28 |
darcy |
8134678: Problem list SecurityManager/CheckPackageAccess.java
|
file |
diff |
annotate
|
2015-08-26 |
darcy |
8134521: Problem list failing java/beans/Introspector test
|
file |
diff |
annotate
|
2015-08-18 |
darcy |
8133808: Place java/lang/ProcessHandle/InfoTest.java on the Problem List
|
file |
diff |
annotate
|
2015-08-14 |
darcy |
8133588: Place TimeoutLockLoops.java on the problem list
|
file |
diff |
annotate
|
2015-08-05 |
darcy |
8133060: Problem list BasicLauncherTest until fix for JDK-8132648 propagates
|
file |
diff |
annotate
|
2015-07-31 |
amurillo |
Merge
|
file |
diff |
annotate
|
2015-07-28 |
olagneau |
8131783: Put LowMemoryTest.java in quarantine
|
file |
diff |
annotate
|
2015-07-24 |
ykantser |
8062938: sun/jvmstat/monitor/MonitoredVm/CR6672135.java: java.lang.IllegalArgumentException: Could not map vmid to user name
|
file |
diff |
annotate
|
2015-07-17 |
amurillo |
Merge
|
file |
diff |
annotate
|
2015-07-14 |
vinnie |
8131184: Add test sun/security/pkcs11/rsa/TestKeyPairGenerator.java to the problem list
|
file |
diff |
annotate
|
2015-07-10 |
ykantser |
8076471: Remove hprof agent tests in JDK
|
file |
diff |
annotate
|
2015-07-02 |
vinnie |
8130151: Exclude sun/security/provider/SecureRandom/StrongSecureRandom.java from testruns on MacOSX 10.10
|
file |
diff |
annotate
|
2015-07-01 |
darcy |
8081547: Prepare client libs regression tests for running in a concurrent, headless jtreg environment
|
file |
diff |
annotate
|
2015-06-29 |
weijun |
8058849: test/sun/security/krb5/config/dns.sh needs to re-examined or replaced
|
file |
diff |
annotate
|
2015-06-15 |
aeriksso |
8081412: Remove MHIllegalAccess.java from the problem list
|
file |
diff |
annotate
|