jdk/test/ProblemList.txt
2016-10-18 cjplummer 8167034: Re-enable TestDaemonThread.java once JDK-8167001 is fixed
2016-10-05 amurillo Merge
2016-09-30 amurillo Merge
2016-09-21 cjplummer 8161225: Assert failure in JVMTI GetNamedModule at JPLISAgent.c line: 792
2016-10-03 jwilhelm 8167026: Quarantine TestDaemonThread.java
2016-09-28 mli 8162519: Remove ParallelPrefix.java from ProblemList.txt
2016-09-15 robm 8165988: Test JarURLConnectionUseCaches.java fails at windows: failed to clean up files after test
2016-09-14 amurillo Merge
2016-09-10 amurillo Merge
2016-09-07 ddmitriev 8165513: Quarantine sun/tools/jps/TestJpsJar.java
2016-09-02 gtriantafill 8165293: Remove ClassesByName2Test.java and RedefineCrossEvent.java from ProblemList.txt
2016-09-01 amurillo Merge
2016-08-29 dsamersoff 8160923: sun/tools/jps/TestJpsJar.java fails due to ClassNotFoundException: jdk.testlibrary.ProcessTools
2016-08-26 amurillo Merge
2016-08-26 dsamersoff 8163346: Update jmap-hashcode/Test8028623.java for better diagnostic of timeout.
2016-09-14 darcy 8166054: Problem list JarURLConnectionUseCaches.java until JDK-8165988 is fixed
2016-09-14 jjiang 8077138: Some PKCS11 tests fail because NSS library is not initialized
2016-09-13 amlu 8165818: Remove tools/pack200/Pack200Props.java from ProblemList
2016-09-12 sundar 8165772: fix for 8165595 results in failure of jdk/test/tools/launcher/VersionCheck.java
2016-09-11 darcy 8165810: Problem list VersionCheck.java until JDK-8165772 is fixed
2016-09-07 ksrini 8151901: test/tools/pack200/Pack200Test fails on verifying native unpacked JAR
2016-08-31 ssahoo 8015595: Test sun/security/krb5/auto/Unreachable.java fails with Timeout error
2016-08-23 psandoz 8160971: Re-enable VarHandle tests quarantined by JDK-8160690
2016-08-22 amurillo 8164589: Remove sun/rmi/runtime/Log/6409194/NoConsoleOutput.java from ProblemList
2016-08-18 amurillo 8164329: Problem list sun/rmi/runtime/Log/6409194/NoConsoleOutput.java on windows due to JDK-8164124
2016-08-12 fyuan 8163435: Update issue number for SupportedDHKeys.java and UnsupportedDHKeys.java in ProblemList
2016-08-12 fyuan 8161340: ProblemList.txt update for sun/security/tools/keytool/autotest.sh
2016-08-12 fyuan 8160611: Clean up ProblemList.txt for closed/resolved issues
2016-08-10 mchung 8136930: Simplify use of module-system options by custom launchers
2016-08-08 amurillo Merge
2016-08-05 amurillo Merge
2016-07-22 amurillo Merge
2016-07-18 dcubed 8161164: quarantine more tests that can't attach symbolicator to the process on MacOS X
2016-08-05 prr Merge
2016-07-28 ddehaven Merge
2016-07-22 bpb 8148454: [PIT] Failure of ReplaceMetadataTest on TIFF with IllegalStateException
2016-08-03 amlu 8161970: Remove tools/jlink/JLinkOptimTest.java from ProblemList.txt
2016-07-21 amlu 8161565: Problem list httpclient/SplitResponse.java
2016-07-15 amurillo Merge
2016-07-15 mli 8154821: Update issue number for sun/security/pkcs11/ec/TestKeyFactory.java in ProblemList
2016-07-14 weijun 8161341: Garbage in ProblemList.txt
2016-07-12 rhalade 8161233: ProblemList sun/security/ssl/SSLSocketImpl/AsyncSSLSocketClose.java on macOS
2016-07-14 dcubed 8161388: quarantine java/lang/instrument/DaemonThread/TestDaemonThread.java
2016-07-08 amurillo Merge
2016-07-08 dcubed Merge
2016-07-08 dcubed Merge
2016-07-07 mli 8157667: sun/security/x509/URICertStore/ExtensionsWithLDAP.java has to be updated due to JDK-8134577
2016-07-06 mli 8160866: IntPrimitiveOpsTests.java still in ProblemList.txt while related bug has been closed
2016-07-05 amurillo Merge
2016-06-30 amurillo 8160690: Quarantine VarHandles tests
2016-07-01 amurillo Merge
2016-07-04 igerasim 8153948: sun/security/mscapi/ShortRSAKey1024.sh fails with "Field length overflow"
2016-06-28 darcy 8160502: Problem listing of several http2 tests
2016-06-24 rriggs 8160278: Remove java/time/test/java/time/TestClock_System from the problem list
2016-07-07 dcubed 8161010: quarantine sun/tools/jps/TestJpsJar.java in JDK9-dev and JDK9-hs
2016-06-24 amurillo Merge
2016-06-22 akulyakh 8159959: Quarantine java/lang/management/MemoryMXBean/Pending.java
2016-06-22 asmotrak 8074580: sun/security/pkcs11/rsa/TestKeyPairGenerator.java fails due to PKCS11Exception: CKR_FUNCTION_FAILED
2016-06-22 naoto 8159781: jlink --include-locales fails with java.util.regex.PatternSyntaxException
2016-06-17 okutsu 8158272: IncludeLocalesPluginTest.java fails with timeout
2016-06-17 weijun 8157387: StrongSecureRandom.java timeout after push for JDK-8141039
2016-06-16 jlaskey 8159206: All jlink or jmod tests failing
2016-06-15 ddehaven Merge
2016-06-13 chegar 8041924: sun/net/www/http/ChunkedOutputStream/checkError.java fails on some systems
2016-06-13 bgopularam 8062758: Update java/security/Security/ClassLoaderDeadlock/Deadlock2.sh with the removal of -Djava.ext.dirs
2016-06-12 mli 8157665: ProblemList.txt needs to be updated as 7041639 closed
2016-06-10 darcy 8159263: Problem list tools/jmod/JmodTest.java
2016-06-10 jlaskey 8159228: Exclude jlink tests until jrt-fs patterns are rectified
2016-06-08 amlu 8159012: Problem list sun/net/www/http/ChunkedOutputStream/checkError.java
2016-06-06 darcy 8158870: Temporarily problem list DGCDeadLock.java on Mac
2016-06-06 ddehaven Merge
2016-06-01 ddehaven Merge
2016-05-27 prr 8157339: Further stabilization for the SwingSet client sanity tests
2016-05-25 ddehaven Merge
2016-05-20 serb 8156579: Two JavaBeans tests failed
2016-05-19 serb 8148915: Intermittent failures of bug6400879.java
2016-06-01 darcy 8158451: Problem list IncludeLocalesPluginTest.java
2016-05-31 rriggs 8158254: Put java/time/test/java/time/TestClock_System on the problem list for Solaris
2016-05-26 amlu 8157663: Remove tools/jimage/JImageTest.java from ProblemList.txt
2016-05-25 amlu 8157813: Remove sun/rmi/transport/proxy/EagerHttpFallback.java from ProblemList.txt
2016-05-25 jjiang 8137255: sun/security/provider/NSASuiteB/TestDSAGenParameterSpec.java timeouts intermittently
2016-05-20 asmotrak 8157344: Multiple test timeouts after push for JDK-8141039
2016-05-19 bchristi 8029891: Deadlock detected in java/lang/ClassLoader/deadlock/GetResource.java
2016-05-18 ksrini 8156807: Pack200 must support v53.0 class files
2016-05-18 serb 8156581: Cleanup of ProblemList.txt
2016-05-18 mli 8157011: Problem list tools/pack200/TestNormal.java and java/io/pathNames/GeneralWin32.java
2016-05-16 xuelei 8156991: Problem list UnsupportedDHKeys.java on windows
2016-05-12 darcy 8156897: Problem list ShortRSAKey1024.sh on windows
2016-05-12 darcy 8156890: Temporarily problem list ListKeychainStore.sh on Mac
2016-05-11 jlaskey 8156781: change to jlink has result in test failure
2016-05-11 jlaskey 8156766: jdk/test/tools/jlink/plugins/SorterPluginTest.java broken
2016-05-09 amlu 8156529: Problem list java/nio/file/WatchService/DeleteInterference.java
2016-05-02 asmotrak 8155859: Problem list tools/pack200/Pack200Props.java
2016-04-27 rriggs 8155182: fix to JDK-8066750 broke jdk9 builds
2016-04-26 rriggs 8066750: Remove HTTP proxy implementation and tests from RMI
2016-04-15 amurillo Merge
2016-04-14 amjiang 8153545: sun/security/pkcs11/Provider/Login.sh fails on Linux
2016-04-14 dcubed Merge
2016-04-11 amurillo Merge
2016-04-11 msheppar 8134577: Eliminate or standardize a replacement for sun.net.spi.nameservice.NameServiceDescriptor
2016-04-08 serb 8153725: Problem list javax/sound/sampled/DirectAudio/bug6400879.java for Linux
2016-04-07 amlu 8153695: Problem list sun/security/pkcs11/Provider/Login.sh for linux-all
2016-04-07 jjiang 8153239: ProblemList update for sun/security/provider/NSASuiteB/TestDSAGenParameterSpec.java
2016-04-06 ksrini 8152622: tools/pack200/Pack200Props.java timed out
2016-04-12 sspitsyn 8153902: remove com/sun/jdi/InterfaceMethodsTest.java, com/sun/jdi/InvokeTest.java from ProblemList
2016-04-07 dcubed Merge
2016-03-31 darcy 8151763: Use more informative format for problem list
2016-03-29 mchung 8153027: Exclude tools/jimage/JImageTest.java
2016-03-25 amlu 8152749: Mark AdaptorCloseAndInterrupt.java as intermittently failing
2016-04-02 jwilhelm Merge
2016-03-24 mchung 8152715: Problem list tools/pack200/Pack200Props.java
2016-03-24 akulyakh 8147987: Remove sun/management/jmxremote/bootstrap/JMXInterfaceBindingTest.java from problemList
2016-03-24 coleenp 8152719: ignore this com/sun/jdi/InterfaceMehtodsTest.java until bug is fix
2016-03-17 alanb 8142968: Module System implementation
2016-03-03 thartmann 8151024: Remove TCKJapaneseChronology.java from the problem list
2016-02-26 amlu 8150608: Mark BashStreams.java as intermittently failing and put to ProblemList
2015-12-28 jbachorik 8145919: sun/management/jmxremote/bootstrap/RmiSslBootstrapTest failed with Connection failed for no credentials
2016-02-18 amlu 8149922: Remove intermittent key from security tests
2016-02-12 darcy 8149616: Problem list RmiSslBootstrapTest.sh
2016-02-09 darcy 8149492: Problem list CheckEncodings.sh
less more (0) -120 tip